program: Gaussian 09
title: 000129705
version: EM64L-G09RevD.01
frameworkgroup: C1[X(C13H14N2)]
method: RPBEPBE
basis: SDD
operation: Freq
keyword: #pfreq=noraman
keyword: PBEPBE/SDD
title: #p freq=noraman PBEPBE/SDD
converged: YES YES NO NO
title: Mulliken charges:
elementType: N N C C C C C C C C C C C C C H H H H H H H H H H H H H H
charge: -0.217731 -0.308036 0.392034 0.219267 0.309849 -0.577090 -0.521882 -0.668263 -0.371646 -0.424489 -0.230090 -0.252358 -0.429696 0.185512 -0.474665 0.260520 0.223359 0.220749 0.228018 0.293040 0.230362 0.232203 0.235954 0.276800 0.218776 0.218817 0.240113 0.214375 0.276196
chargesum: 0.00000
title: Mulliken charges with hydrogens summed into heavy atoms:
elementType: N N C C C C C C C C C C C C C
charge: -0.217731 -0.031237 0.392034 0.219267 0.309849 -0.316570 -0.077774 0.083157 -0.139443 -0.188535 -0.011314 -0.033541 0.024792 0.185512 -0.198468
polarizability: 2.28530100e+02 -3.37238652e+00 1.41729692e+02 1.03463434e+01 2.05915111e+00 9.69423329e+01
1716.lowfreq: -0.0008 0.0004 0.0004 2.4780 4.0921 8.5980 33.0595 44.3581 80.6752
frequency: 33.0582 44.3549 80.6616 116.3371 127.7578 141.5165 180.3850 202.7162 251.7944 268.1353 270.5717 290.6863 324.2222 340.8771 435.9461 495.7504 525.9436 529.5438 565.3970 577.4982 628.7925 633.9425 663.3461 690.0718 702.4733 718.7329 742.2422 756.8775 801.4271 840.2232 852.8591 896.4563 930.7333 941.9562 958.2611 969.7197 976.5745 1011.2185 1065.6381 1095.4086 1107.2356 1123.7362 1135.9559 1148.6403 1160.4325 1172.1517 1197.9075 1238.6394 1248.7205 1304.3577 1320.7095 1340.0354 1372.8693 1393.5299 1414.8137 1436.8016 1439.7753 1467.3817 1474.9353 1478.9689 1480.3798 1490.0155 1501.3164 1556.8275 1584.5624 1626.5890 2148.6440 2856.3794 2894.9326 2966.7354 2969.6925 2986.2809 3058.5035 3091.4003 3122.5832 3131.7872 3145.1524 3161.6273 3210.7474 3426.2582 3450.1989
redmass: 4.3872 5.1155 2.7311 3.0594 2.6285 2.1223 1.5203 4.3803 3.5209 3.9146 4.3989 2.3643 3.1337 5.0076 3.0463 4.2942 5.2059 4.2183 5.2802 3.5883 3.8396 1.2491 1.2699 1.3283 4.2434 4.7292 1.3023 2.9994 1.4725 3.3284 1.5545 4.5346 1.3858 1.8095 2.5929 1.3006 2.1528 2.1165 2.3462 2.4229 4.6889 1.3015 1.5151 1.5128 1.4020 1.2481 1.3076 1.3716 1.8728 1.3069 1.6943 3.2153 1.5507 3.0460 3.1655 1.6611 1.1737 1.8704 1.2340 2.3838 1.2329 1.1759 1.0575 6.8146 6.5569 7.4178 6.0214 1.0709 1.0677 1.0850 1.0410 1.0851 1.0988 1.1016 1.0845 1.0889 1.0953 1.1002 1.0978 1.1600 1.0755
irintensity: 0.3571 0.0782 2.7242 0.8058 0.3483 5.9681 4.9651 2.1799 2.7879 0.3399 1.1671 0.2437 5.6006 1.5139 6.9203 9.0235 0.3118 1.9050 4.2022 0.0998 1.8998 76.0982 41.5909 139.2380 5.9744 2.7431 51.2366 28.3641 51.6889 1.8162 4.9782 2.0446 4.6377 17.4062 2.5480 0.0796 8.4546 10.5306 1.8782 5.5507 53.1760 3.7027 15.7317 18.4285 4.9618 2.5285 12.6788 1.9579 4.4408 14.3807 29.6768 23.0099 12.0012 28.1413 35.3856 4.7810 59.5081 15.2462 5.2519 43.9421 13.1551 1.2381 11.8693 7.0017 0.7651 2.4219 2.1865 95.8634 85.7564 15.2131 89.8755 21.3125 22.6300 2.6174 0.3238 4.9367 39.0574 34.8787 4.5155 68.3391 1.6564
temp: 298.150 k
press: 1.00000 atm
elementType: 7 7 6 6 6 6 6 6 6 6 6 6 6 6 6 1 1 1 1 1 1 1 1 1 1 1 1 1 1
symmnumber: 1
zpe: 619177.0 jmol-1
zpe.correction: 0.235832 hartree
zpe.thermalcorrener: 0.250003 hartree
zpe.thermalcorrenthalpy: 0.250947 hartree
zpe.thermalcorrgfe: 0.194202 hartree
zpe.sumelectzpe: -612.133508 hartree
zpe.sumelectthermal: -612.119338 hartree
zpe.sumelectthermalent: -612.118393 hartree
zpe.sumelectthermalfe: -612.175138 hartree
dipole: -2.0548 0.1041 -0.8111
dipole: 2.2115
quadrupole: -86.7009 -80.7571 -88.9158
quadrupole: 2.5431 1.5825 -0.6091
quadrupole: -1.2429 4.7008 -3.4579 2.5431 1.5825 -0.6091
hfenergy: -612.3693403 hartree
pointgroup: C01 [X(C13H14N2)]
dipole: 0.7987021 0.2066947 0.2763854 debye
polarizability: 227.6283703|11.5375977|132.6877287|9.5072342|-18.2223746|106.8860264 unknown
InChI: InChI=1S/C13H14N2/c1-3-8-14-10-12-9-11-6-4-5-7-13(11)15(12)2/h1,4-7,9,14H,8,10H2,2H3
charge 0 multiplicity 1
29 atoms
N  -0.448422 0.791525 0.232116
N  2.55851 -0.046093 0.171926
C  0.181842 -0.328164 0.816935
C  -1.775274 0.452318 -0.065939
C  -1.982767 -0.918833 0.332397
C  -0.731338 -1.384338 0.885825
C  1.60824 -0.294621 1.290408
C  0.159407 2.106219 0.003067
C  -2.801661 1.228973 -0.649796
C  -3.257237 -1.510934 0.129183
C  -4.056327 0.614211 -0.839527
C  -4.282071 -0.741222 -0.454745
C  3.98072 -0.055558 0.599126
C  4.901227 0.136957 -0.535234
C  5.682976 0.277614 -1.477696
H  -0.519389 -2.373322 1.289815
H  1.755821 0.519346 2.031815
H  1.809186 -1.251874 1.827774
H  -0.120712 2.827141 0.79508
H  1.254628 1.985999 -0.032007
H  -0.173231 2.50748 -0.97053
H  -2.640281 2.272324 -0.941888
H  -3.440617 -2.550752 0.422798
H  2.390681 -0.684335 -0.61796
H  -4.874602 1.18833 -1.288827
H  -5.271039 -1.184285 -0.617467
H  4.125581 0.767859 1.327657
H  4.265972 -0.997956 1.131741
H  6.360877 0.406691 -2.301646
