program: Gaussian 09
title: 000129819
version: EM64L-G09RevD.01
frameworkgroup: C1[X(C16H22O3)]
method: RPBEPBE
basis: SDD
operation: Freq
keyword: #pfreq=noraman
keyword: PBEPBE/SDD
title: #p freq=noraman PBEPBE/SDD
converged: YES YES NO NO
title: Mulliken charges:
elementType: O O O C C C C C C C C C C C C C C C C H H H H H H H H H H H H H H H H H H H H H H
charge: -0.269084 -0.269585 -0.254618 -0.206783 -0.154789 -0.173796 -0.165150 -0.522001 -0.468741 -0.477722 -0.094756 -0.269336 -0.256300 -0.259814 -0.272613 0.173830 0.340645 -0.758055 -0.633022 0.237046 0.248080 0.239730 0.225608 0.220571 0.244240 0.206494 0.227649 0.230287 0.207265 0.186191 0.239244 0.245790 0.203094 0.183871 0.248715 0.218935 0.247935 0.235229 0.213292 0.227867 0.254556
chargesum: 0.00000
title: Mulliken charges with hydrogens summed into heavy atoms:
elementType: O O O C C C C C C C C C C C C C C C C
charge: -0.269084 -0.269585 -0.254618 0.030263 0.093291 0.065934 0.060458 -0.057190 -0.034598 -0.040170 0.091434 -0.030092 -0.010509 0.127151 0.195037 0.173830 0.340645 -0.061599 -0.150598
polarizability: 2.10844118e+02 3.82231391e+00 1.71349188e+02 5.38347902e-01 6.97783866e+00 1.40739103e+02
1716.lowfreq: -4.5465 -0.0004 -0.0004 0.0008 3.2646 9.1922 11.8145 23.0973 26.3020
frequency: 10.0962 23.0484 26.1262 55.3432 66.9757 76.7824 118.9863 141.5230 172.0324 176.9186 203.1919 231.3832 236.0090 272.4006 290.1712 314.8292 366.8778 374.6626 392.8724 394.9833 435.8035 461.5067 483.7136 526.9438 558.9697 581.0883 633.7739 695.5965 727.9168 756.1600 783.3237 784.5167 792.1495 795.1676 807.5694 842.4119 852.2262 866.7115 874.6553 886.3879 922.2216 925.0526 946.9016 951.7922 956.3181 963.2759 965.6059 988.5359 991.5141 1007.2864 1009.1829 1020.9283 1028.8745 1043.6648 1050.7578 1054.0950 1059.9514 1072.2454 1101.6608 1109.5750 1111.5003 1120.9379 1125.6135 1146.8090 1181.9242 1189.1497 1199.6317 1211.3224 1244.1008 1247.8491 1253.2484 1260.7246 1266.9125 1273.3580 1288.3557 1290.3997 1297.2978 1300.2454 1309.3029 1316.0836 1344.9838 1359.3196 1394.8809 1396.7669 1415.0734 1452.0375 1456.1039 1463.6147 1468.9098 1472.2301 1472.7920 1489.3978 1607.0650 1630.1087 1654.7503 2896.3880 2924.3766 2982.6059 2987.6602 2988.9504 2992.9873 3006.9658 3010.8687 3017.2242 3024.7502 3042.7490 3047.9627 3061.8162 3071.0733 3072.8769 3080.0278 3085.8285 3097.3438 3103.5257 3134.1799 3175.4222 3215.6669
redmass: 4.6550 4.3861 3.8690 3.5089 4.1827 4.2961 4.6741 3.0587 1.9672 1.5103 3.1378 4.3934 2.1908 2.0738 3.7541 3.6440 2.7645 2.9180 3.1308 3.6213 2.8524 2.5307 3.7106 3.3210 3.5725 3.5535 1.5490 2.8172 3.8710 2.1181 2.8525 2.4446 2.9939 1.7899 3.6487 2.7282 2.3273 3.6770 2.3698 2.6512 2.6840 2.3518 2.0017 1.9175 1.5047 2.0342 2.7244 1.3190 2.1164 1.8342 1.4073 2.1071 1.8552 1.5509 2.5135 1.5045 1.8684 1.9599 1.1083 1.1537 2.2302 4.5410 1.1995 2.1987 1.7407 1.5947 1.1253 1.2023 1.4033 1.1048 1.4585 1.3342 1.3627 1.5027 3.1009 1.6668 1.4554 1.4358 1.5813 1.5354 1.6486 1.4659 1.4620 1.2429 1.2494 1.0794 1.0450 1.0791 1.0837 1.0783 1.0731 1.0980 11.3939 6.7696 5.1918 1.0829 1.0595 1.0989 1.0847 1.0361 1.0588 1.0621 1.0602 1.0600 1.0863 1.0913 1.1006 1.0917 1.1043 1.0970 1.1059 1.1059 1.1009 1.0618 1.0877 1.1049 1.1156
irintensity: 0.0181 0.7614 0.6279 0.1642 1.1112 2.3793 2.0258 4.3544 1.3830 2.2317 0.3482 0.3775 4.7444 0.8323 4.9464 3.9265 2.2449 0.9889 6.3503 1.7610 0.5748 5.2107 3.2659 3.3899 6.1017 4.1590 9.9545 3.1160 3.1464 30.4855 5.0000 6.2072 3.2019 11.5591 0.3698 15.2706 0.4385 8.2704 0.9116 1.7413 0.6468 6.7252 1.8880 2.8683 3.7031 54.0941 107.0061 58.7565 5.7896 5.3329 8.5745 18.4306 12.1923 25.0716 45.0053 5.7873 26.7924 11.2760 16.6586 10.5729 17.6521 396.6983 9.9746 0.8294 2.3405 2.8443 4.4022 0.6503 4.5273 1.8802 2.4790 0.6921 0.8869 0.5826 130.3862 1.4315 4.5667 16.3164 1.6272 5.0784 22.7189 4.0651 5.9222 15.9783 9.3443 15.4372 14.3774 19.1599 7.4823 2.5978 48.7148 6.7793 159.3954 4.7610 3.3805 46.8084 70.9835 33.4136 22.0357 16.4554 30.3143 76.5995 29.5712 31.0111 27.7667 64.6358 14.6604 16.3191 62.0688 14.8802 54.7006 19.0849 27.2373 5.2462 10.5830 23.0156 5.4989
temp: 298.150 k
press: 1.00000 atm
elementType: 8 8 8 6 6 6 6 6 6 6 6 6 6 6 6 6 6 6 6 1 1 1 1 1 1 1 1 1 1 1 1 1 1 1 1 1 1 1 1 1 1
symmnumber: 1
zpe: 909133.8 jmol-1
zpe.correction: 0.346271 hartree
zpe.thermalcorrener: 0.364553 hartree
zpe.thermalcorrenthalpy: 0.365497 hartree
zpe.thermalcorrgfe: 0.296671 hartree
zpe.sumelectzpe: -847.066593 hartree
zpe.sumelectthermal: -847.048311 hartree
zpe.sumelectthermalent: -847.047367 hartree
zpe.sumelectthermalfe: -847.116193 hartree
dipole: 3.0947 1.7397 -1.1480
dipole: 3.7312
quadrupole: -121.3931 -108.7577 -110.6126
quadrupole: -9.3840 -0.6475 4.5306
quadrupole: -7.8053 4.8301 2.9752 -9.3840 -0.6475 4.5306
hfenergy: -847.412864 hartree
pointgroup: C01 [X(C16H22O3)]
dipole: 1.2266793 -0.4818041 0.6465882 debye
polarizability: 210.8456664|-3.8776138|172.1456494|-0.1975236|-4.83646|139.9410931 unknown
InChI: InChI=1S/C16H22O3/c1-10(2)16(17)19-8-7-18-14-6-5-13-11-3-4-12(9-11)15(13)14/h5-6,11-15H,1,3-4,7-9H2,2H3
charge 0 multiplicity 1
41 atoms
O  -0.116952 1.504854 -0.783327
O  -2.681571 0.409357 0.297958
O  -4.885956 1.091332 -0.025878
C  2.759464 0.191734 1.248279
C  1.78949 0.0383 0.039401
C  4.053047 -0.886674 -0.294544
C  2.674263 -0.731106 -1.02855
C  4.128229 0.423872 0.54023
C  2.974084 -1.215309 1.885166
C  3.872283 -1.957334 0.823991
C  1.354309 1.378282 -0.640835
C  2.674989 0.19237 -2.231088
C  1.96308 1.330345 -2.025481
C  -0.769137 1.888029 0.470786
C  -2.271805 1.838831 0.258462
C  -4.049092 0.165739 0.125856
C  -4.341177 -1.306714 0.152263
C  -3.191054 -2.276572 0.326301
C  -5.641718 -1.684595 0.011398
H  2.450008 0.966714 1.970979
H  0.879284 -0.528456 0.309542
H  4.898097 -1.081706 -0.97563
H  2.2768 -1.72991 -1.295607
H  4.980374 0.436607 1.243199
H  4.159974 1.336184 -0.080499
H  2.015221 -1.734688 2.065836
H  3.49434 -1.129629 2.856648
H  4.849506 -2.238846 1.256801
H  3.400057 -2.879707 0.43979
H  1.716136 2.261545 -0.061676
H  3.204836 -0.053872 -3.158446
H  1.810315 2.138635 -2.746614
H  -0.484933 1.206429 1.300815
H  -0.472946 2.924155 0.753509
H  -2.550181 2.268671 -0.7195
H  -2.813575 2.383641 1.053503
H  -2.436416 -2.139051 -0.468575
H  -2.669754 -2.104003 1.285254
H  -3.551594 -3.318909 0.301352
H  -5.933237 -2.740401 0.016894
H  -6.428091 -0.932144 -0.113263
