program: Gaussian 09
title: 000129698
version: EM64L-G09RevD.01
frameworkgroup: C1[X(C11H12N2S)]
method: RPBEPBE
basis: SDD
operation: Freq
keyword: #p
keyword: freq=noraman
keyword: PBEPBE/SDD
title: #p freq=noraman PBEPBE/SDD
converged: YES YES NO NO
title: Mulliken charges:
elementType: S N N C C C C C C C C C C C H H H H H H H H H H H H
charge: 0.148979 -0.027692 -0.391333 -0.595983 -0.420408 -0.160032 0.080572 0.447896 -0.449771 -0.338866 -0.197762 -0.223348 -0.257372 -0.577520 0.265433 0.239255 0.239283 0.318012 0.250976 0.220014 0.311492 0.225515 0.224027 0.227490 0.222724 0.218421
chargesum: 0.00000
title: Mulliken charges with hydrogens summed into heavy atoms:
elementType: S N N C C C C C C C C C C C
charge: 0.148979 -0.027692 -0.073322 -0.330550 0.058129 -0.160032 0.331548 0.447896 -0.229758 -0.027375 0.027753 0.000679 -0.029882 -0.136374
polarizability: 2.53320049e+02 2.65511174e+00 1.37478433e+02 -1.81211827e+00 -3.11758588e+00 8.34209929e+01
1716.lowfreq: -10.1253 -8.8958 -3.9171 -0.0008 0.0015 0.0023 33.6246 49.1345 79.8492
frequency: 33.6175 49.1236 79.8420 91.0975 125.5662 203.6047 232.6258 260.3360 275.7280 298.0406 304.4261 369.4311 409.6017 498.6825 506.1384 532.0386 550.7427 573.3888 583.8715 615.4956 696.0678 697.5415 751.5997 763.3596 791.0129 805.8907 834.9888 840.2462 914.0804 946.9467 955.4547 970.6334 981.2537 984.0684 999.6691 1004.5534 1014.2558 1026.1754 1086.2293 1120.8279 1161.2284 1171.6506 1187.7396 1189.7856 1225.8087 1261.4076 1275.3328 1294.0144 1310.8428 1324.1198 1384.6244 1430.4844 1433.2275 1460.7648 1484.1329 1517.1996 1601.3349 1615.1472 1649.7231 1660.7464 2976.5339 3055.6266 3075.0703 3089.7076 3108.4547 3111.5333 3130.6186 3142.9128 3164.2534 3180.9000 3200.5319 3549.5255
redmass: 4.7129 4.1672 4.6003 3.6383 4.0490 4.2164 5.3286 3.8455 3.8893 3.0955 2.1880 3.5478 2.9360 2.3567 6.3769 7.2474 1.5262 5.6148 4.9246 6.3871 1.9866 1.9839 4.4160 1.6823 5.0429 5.7310 2.2840 1.2778 1.4186 1.4567 2.3229 1.3487 1.7478 5.8157 1.3037 2.3847 1.2476 2.1473 1.5761 1.5164 2.2601 1.0562 1.3317 1.5434 1.3624 1.6130 1.6469 1.2183 1.2680 1.4134 6.3839 1.2075 2.2874 1.0862 2.3223 1.8424 4.6982 5.9708 4.5922 8.4516 1.0649 1.0982 1.0869 1.0604 1.0886 1.0941 1.0866 1.0932 1.0991 1.0962 1.1144 1.0764
irintensity: 0.3664 0.0838 0.3285 0.3077 0.6798 1.7932 3.5251 3.5952 9.2531 5.8810 0.7989 2.4279 0.0022 44.4464 6.3796 45.1413 24.6703 9.4423 4.5294 0.1258 23.1676 38.0888 8.2438 88.4328 30.5428 5.4353 1.8049 0.0721 11.9779 62.0746 94.3194 0.1756 29.9086 3.6077 2.3550 46.3066 13.7403 19.9888 27.6166 9.0097 1.8500 1.0115 2.6515 16.5190 12.0090 33.1060 28.3332 3.1096 22.2591 48.4569 61.2978 24.8501 59.9932 5.1836 90.3596 319.3630 26.9234 139.5518 5.0552 357.3231 51.8827 18.8866 11.0994 11.8707 14.6555 5.3619 0.5577 31.7616 23.4773 16.3017 20.7565 30.5662
temp: 298.150 k
press: 1.00000 atm
elementType: 16 7 7 6 6 6 6 6 6 6 6 6 6 6 1 1 1 1 1 1 1 1 1 1 1 1
symmnumber: 1
zpe: 539535.2 jmol-1
zpe.correction: 0.205498 hartree
zpe.thermalcorrener: 0.218399 hartree
zpe.thermalcorrenthalpy: 0.219343 hartree
zpe.thermalcorrgfe: 0.164952 hartree
zpe.sumelectzpe: -932.899041 hartree
zpe.sumelectthermal: -932.886140 hartree
zpe.sumelectthermalent: -932.885196 hartree
zpe.sumelectthermalfe: -932.939587 hartree
dipole: 0.8101 -0.4661 0.2004
dipole: 0.9558
quadrupole: -77.1695 -86.0131 -92.7295
quadrupole: 5.7577 -2.1344 -2.2362
quadrupole: 8.1345 -0.7090 -7.4255 5.7577 -2.1344 -2.2362
hfenergy: -933.1045391 hartree
pointgroup: C01 [X(C11H12N2S1)]
dipole: -0.3128892 -0.1759339 -0.1121003 debye
dipolederiv: -0.913867 -0.1261564 -0.1152442 -0.1085386 -0.4250258 0.0340176 -0.0457773 0.0061455 -0.1668431 -0.940393 -0.0913851 0.0406322 0.29263 -0.9349516 -0.2768137 0.0704118 -0.1156201 -0.3689462 -2.268307 0.0079111 0.2113582 -0.1268734 -0.3622703 0.0107105 0.3227995 0.0077595 -0.3272498 0.3471157 -0.1534059 0.0693506 -0.446866 0.1569878 -0.128588 0.0809729 -0.0845355 0.1645625 0.4705113 -0.0386691 -0.099222 0.0274357 0.270604 0.0792447 -0.0395987 0.0945491 0.2732182 2.2887798 0.1700982 -0.1939051 -0.2232408 0.9820088 0.3460262 -0.5106589 0.1584404 0.1802911 0.0852131 0.0332629 -0.0138914 -0.0356248 -0.1665019 -0.1247024 0.1332225 -0.1226538 0.0613579 1.4542673 0.2126358 -0.0765906 0.7609734 0.154134 -0.0822438 0.0480147 -0.0117596 0.1037878 -0.428115 -0.0721293 -0.0049935 0.0712306 0.0423992 0.0668175 0.0549194 0.0862027 -0.1963301 -0.290523 -0.0130723 0.0048594 -0.3591713 -0.145749 0.0469381 -0.0962031 0.0057103 -0.1554813 0.1465754 0.0119082 -0.0333743 -0.0447875 0.0867961 0.0765139 -0.0517669 0.0680559 -0.1133304 0.1102478 -0.010376 -0.0357941 0.103031 0.1529239 0.0796077 -0.0089666 0.0909761 -0.1152725 -0.1136494 0.0710282 0.0053556 0.0323728 -0.1395004 0.0108203 -0.0001998 0.0071436 -0.1904253 -0.1537727 0.0680388 -0.091185 0.1164128 -0.3239653 -0.1342223 -0.1709827 -0.1165709 0.013472 -0.0893245 -0.0094611 0.0934942 0.0117579 0.0677477 0.0315193 0.0293007 0.0282842 0.0012597 0.0086452 0.0406175 0.0103336 0.1198536 -0.0910671 0.0211484 -0.0217065 0.052989 0.0874312 -0.0974929 0.0382118 0.0169957 -0.0387753 0.0902705 0.0307675 0.0584698 -0.0600865 -0.1806215 0.1744665 -0.0284842 0.0308586 -0.0505873 0.1722554 -0.0403875 -0.0021151 -0.0474422 0.2743104 0.0086973 -0.0510917 0.0907038 -0.0237741 0.1134322 0.055937 0.0382082 0.0486337 0.0059231 0.0723317 -0.0830316 -0.0105338 -0.053052 -0.0957223 -0.074302 -0.0019223 -0.0675333 0.1474971 0.1864435 0.0689836 0.0223611 0.0779113 0.0903247 -0.0313639 0.0250367 -0.0329034 0.1592402 -0.0609461 0.0890634 0.0554912 0.1067189 0.0191153 -0.0561901 0.0615755 -0.0552041 0.1321074 0.068201 -0.0261 0.0022404 -0.0653481 -0.0985135 -0.0696203 -0.0093911 -0.0722848 0.1298456 -0.1191974 -0.0793824 0.0129968 -0.0834107 0.0660299 -0.0213498 0.0153031 -0.0215394 0.1617278 0.0378031 0.0076754 -0.0563318 -0.0122052 0.1749324 0.072042 -0.0949743 0.0820593 -0.0691863 0.0162891 -0.0366898 0.0640345 -0.0480728 0.1433051 0.0776735 0.1160286 0.0711841 -0.0123456 unknown
polarizability: 253.3589062|1.4918557|134.5114099|-2.1570453|12.5806503|86.3491596 unknown
InChI: InChI=1S/C11H12N2S/c1-2-10-8-12-11(14-10)13-9-6-4-3-5-7-9/h2-7,10,13H,1,8H2
charge 0 multiplicity 1
26 atoms
S  -2.208348 -1.620551 0.367704
N  -0.99022 0.816676 0.653755
N  0.45907 -0.97318 -0.069037
C  -3.335492 -0.067438 0.499332
C  -2.378818 1.015227 1.11406
C  -0.745693 -0.417564 0.317505
C  -3.869686 0.302007 -0.857483
C  1.751024 -0.37565 -0.067288
C  2.845322 -1.190111 -0.469074
C  1.978378 0.9732 0.313746
C  4.152193 -0.663897 -0.486234
C  3.295152 1.482404 0.294288
C  4.38758 0.677592 -0.102432
C  -5.185602 0.289369 -1.18944
H  -4.147941 -0.322836 1.199049
H  -2.727076 2.022222 0.823104
H  -2.407015 0.948852 2.22076
H  0.415112 -1.933331 -0.414051
H  -3.116972 0.611595 -1.596739
H  2.672195 -2.233742 -0.763559
H  1.129469 1.593113 0.609287
H  4.986117 -1.302805 -0.797516
H  3.4647 2.523899 0.590512
H  5.403617 1.085921 -0.1146
H  -5.527472 0.58335 -2.187589
H  -5.957795 -0.018522 -0.472962
