program: Gaussian 09
title: 000129682
version: EM64L-G09RevD.01
frameworkgroup: C1[X(C7H9NO3)]
method: RPBEPBE
basis: SDD
operation: Freq
keyword: #pfreq=noraman
keyword: PBEPBE/SDD
title: #p freq=noraman PBEPBE/SDD
converged: YES YES NO NO
title: Mulliken charges:
elementType: O O O N C C C C C C C H H H H H H H H H
charge: -0.440928 -0.385524 -0.255303 -0.122283 0.342388 -0.437555 -0.358301 -0.446137 -0.647890 0.191342 0.146114 0.251746 0.229717 0.232382 0.228496 0.302119 0.228844 0.241209 0.351020 0.348542
chargesum: 0.00000
title: Mulliken charges with hydrogens summed into heavy atoms:
elementType: O O O N C C C C C C C
charge: -0.089907 -0.036983 -0.255303 -0.122283 0.342388 -0.185808 -0.128583 0.014741 0.124282 0.191342 0.146114
polarizability: 1.29183073e+02 1.06032706e+01 1.06436741e+02 -4.25162892e+00 7.69031341e-01 5.30159158e+01
1716.lowfreq: -12.5594 -6.3919 -0.0007 -0.0005 0.0007 6.3410 75.0911 88.0344 155.5796
frequency: 75.0780 88.0327 155.5731 167.9222 194.5823 264.4651 294.0481 305.8406 342.8958 352.6301 386.8794 393.2234 414.2156 437.2927 508.5652 578.9171 646.7032 697.9051 732.1057 744.5992 801.5355 820.3449 860.8167 921.8051 971.0133 1072.7554 1085.1930 1118.1880 1151.2173 1152.8840 1191.2495 1221.1558 1279.2420 1297.3533 1315.2824 1368.0976 1405.6852 1445.0220 1453.9548 1465.7944 1489.3848 1510.7768 1541.4578 1575.8837 1634.1359 2984.5544 3012.2797 3078.3738 3081.3257 3114.0735 3138.2249 3162.4465 3555.2474 3559.4644
redmass: 4.7760 4.3234 1.6493 1.9761 4.0425 4.3614 4.7480 2.6294 1.6818 1.6952 3.5878 1.4877 3.1201 6.4294 6.3209 3.4313 7.1561 6.4251 3.3794 6.1557 1.4588 3.2603 1.5485 3.2943 1.9856 1.7425 3.1243 1.3126 1.2776 1.7733 2.4892 1.8086 1.6268 3.4160 1.3204 1.1895 1.9415 1.4194 1.7480 1.1044 1.3732 1.1322 9.0220 6.6393 6.6007 1.0376 1.0613 1.1034 1.0979 1.1024 1.0920 1.0918 1.0660 1.0664
irintensity: 1.1358 7.7648 1.2709 13.4537 4.0454 6.2355 10.2241 19.1491 53.8745 64.9420 43.1041 120.7966 3.2829 10.6904 6.4729 29.6343 21.5790 3.1702 1.0208 7.4777 22.7044 7.7085 52.2708 84.0901 4.9564 25.3335 222.1677 20.9137 11.5766 45.6718 53.2733 11.0003 18.3737 74.5329 34.1909 24.2268 10.8205 4.7972 13.9200 23.3309 16.3998 24.6363 65.6115 125.8933 196.1349 65.4425 38.7633 17.5518 18.3903 1.3894 15.8058 1.9029 30.0697 8.8837
temp: 298.150 k
press: 1.00000 atm
elementType: 8 8 8 7 6 6 6 6 6 6 6 1 1 1 1 1 1 1 1 1
symmnumber: 1
zpe: 404443.6 jmol-1
zpe.correction: 0.154044 hartree
zpe.thermalcorrener: 0.164856 hartree
zpe.thermalcorrenthalpy: 0.165800 hartree
zpe.thermalcorrgfe: 0.118008 hartree
zpe.sumelectzpe: -551.700371 hartree
zpe.sumelectthermal: -551.689560 hartree
zpe.sumelectthermalent: -551.688616 hartree
zpe.sumelectthermalfe: -551.736407 hartree
dipole: 4.9543 5.1983 -0.1272
dipole: 7.1822
quadrupole: -82.7783 -55.3588 -63.0264
quadrupole: -14.6074 -1.7657 -0.4860
quadrupole: -15.7238 11.6957 4.0281 -14.6074 -1.7657 -0.4860
hfenergy: -551.8544159 hartree
pointgroup: C01 [X(C7H9N1O3)]
dipole: 1.8797513 2.1054597 0.134364 debye
dipolederiv: -0.7641797 0.2314304 -0.1834668 0.2468138 -0.4227167 -0.0922699 -0.3306491 -0.0953399 -0.5525564 -1.214684 0.410984 0.1095587 0.5278746 -0.1685173 -0.0089965 0.1433433 -0.0118956 -0.4045624 -0.9011065 -0.4429355 -0.0256587 -0.4801593 -0.7999287 -0.0212901 -0.0239373 -0.023266 -0.3720423 -0.7979854 -0.3290953 0.0452828 -0.1178782 -0.6998762 -0.0562208 -0.0331184 -0.1582342 -0.1053374 -0.0342976 0.156433 -0.0454526 0.1818355 0.7444745 0.0690828 0.066328 0.0716531 -0.0812509 -0.519278 -0.4422314 -0.0451081 0.091835 -0.104504 0.0255273 0.0039617 0.0685507 -0.2158327 0.3397531 0.3539657 -0.0049439 -0.2260266 0.0991251 0.053668 -0.0393747 0.0306677 -0.163124 0.6290388 -0.0370355 0.1432561 -0.1424251 0.3050152 0.0221324 0.1877824 0.0357681 0.5388112 0.319608 0.3037566 -0.068707 0.2831235 0.3498282 -0.0265221 -0.0127064 0.0274027 0.205266 1.0947599 -0.4309428 -0.1335439 -0.6929151 -0.2874585 0.0240147 -0.1840214 0.0068919 0.0459949 0.9926471 0.5748805 0.0267148 0.5949957 0.8093984 0.0334481 0.0312279 0.0433287 0.1770213 0.0544073 0.0461638 0.0158205 0.0532841 -0.0292359 -0.0281218 0.0156991 -0.028796 0.1518315 0.0573768 0.0260447 0.0107663 0.0507723 -0.0907443 -0.0408333 0.0106816 -0.0436076 0.1755784 -0.047981 -0.0254973 0.0493918 -0.0831354 0.0439864 0.1116845 0.0055206 0.0641435 -0.0248611 0.050563 -0.0529258 -0.0600237 0.0332275 -0.1242499 -0.1033233 -0.0326346 -0.0461416 0.0169856 -0.0020246 -0.0580761 -0.0250144 0.0265333 0.1516936 0.0313258 -0.0218836 0.0081488 0.0891026 0.067267 0.0953989 0.0768131 -0.0176146 -0.0636537 -0.0764777 0.0321038 -0.099066 0.051342 0.0216053 -0.0919689 0.0231792 -0.1092506 -0.0083278 0.0298278 0.0939624 0.114677 -0.1072916 0.3070445 -0.1594221 0.1041898 -0.1512083 0.2304155 0.0910834 0.0956571 0.0667869 0.197645 0.3474658 -0.128927 -0.013054 -0.0696822 0.0652762 -0.0377392 -0.0079425 -0.0316721 0.3772801 unknown
polarizability: 128.5812856|11.4988873|106.7927138|-1.9980304|4.6288191|53.2617299 unknown
InChI: InChI=1S/C7H9NO3/c1-8-3-7(11)6(10)2-5(8)4-9/h2-3,9,11H,4H2,1H3
charge 0 multiplicity 1
20 atoms
O  3.252536 -0.552396 0.756951
O  -3.017396 0.896646 0.215205
O  -2.41353 -1.805997 -0.204895
N  0.70242 0.995889 -0.065142
C  0.982954 -0.354618 -0.274372
C  -0.051434 -1.280928 -0.31718
C  -0.62775 1.399341 0.091071
C  2.426823 -0.780553 -0.450738
C  1.766777 2.026836 -0.07885
C  -1.686866 0.506701 0.051343
C  -1.469533 -0.94658 -0.163269
H  0.184319 -2.337891 -0.475989
H  -0.780479 2.4722 0.252778
H  2.940476 -0.19538 -1.23197
H  2.443481 -1.84502 -0.749291
H  2.678525 1.622196 0.387195
H  1.432928 2.898319 0.507462
H  1.989051 2.358394 -1.110414
H  2.876246 -1.085352 1.503091
H  -3.096149 1.874992 0.353016
