program: Gaussian 09
title: 000129723
version: EM64L-G09RevD.01
frameworkgroup: C1[X(C18H17N3S)]
method: RPBEPBE
basis: SDD
operation: Freq
keyword: #p
keyword: freq=noraman
keyword: PBEPBE/SDD
title: #p freq=noraman PBEPBE/SDD
converged: YES YES NO NO
title: Mulliken charges:
elementType: S N N N C C C C C C C C C C C C C C C C C C H H H H H H H H H H H H H H H H H
charge: 0.202120 -0.261209 -0.075061 -0.002772 -0.374330 -0.460686 -0.512582 0.117557 0.206025 -0.024060 0.311086 0.332482 -0.309392 -0.342157 -0.389597 -0.412022 -0.235520 -0.170608 -0.368032 -0.348616 -0.233249 -0.865410 0.231369 0.252359 0.238148 0.242806 0.243173 0.253397 0.221056 0.266150 0.269898 0.249728 0.238901 0.237462 0.238276 0.242085 0.261010 0.264757 0.265458
chargesum: 0.00000
title: Mulliken charges with hydrogens summed into heavy atoms:
elementType: S N N N C C C C C C C C C C C C C C C C C C
charge: 0.202120 -0.261209 -0.075061 -0.002772 0.109398 0.020269 -0.016011 0.117557 0.206025 -0.024060 0.311086 0.332482 -0.088336 -0.076008 -0.119699 -0.162293 0.003380 0.066854 -0.129756 -0.106531 -0.233249 -0.074186
polarizability: 3.60967371e+02 1.14239184e+00 2.70360186e+02 1.63858828e+01 -1.20884345e+01 1.30379453e+02
1716.lowfreq: -7.1304 -5.7806 -0.0021 -0.0008 0.0008 4.9337 26.4904 32.5051 45.8772
frequency: 26.4447 32.4957 45.8321 51.2744 72.3462 87.2135 102.0285 116.9810 156.8769 169.5729 199.6696 207.4635 219.1066 232.8600 252.6871 286.6664 321.2615 337.3790 371.9979 386.7335 396.6535 408.4067 454.8829 506.2037 527.9274 594.8468 621.3546 634.8900 651.9309 659.1446 670.1491 672.2497 699.8405 708.5797 731.2369 742.4748 746.5573 792.4550 826.0049 831.3223 841.8979 855.8369 882.0916 898.4294 911.7917 954.5027 957.0751 959.9257 964.0115 965.9127 974.5697 979.3083 987.5577 1004.0394 1017.1569 1061.3547 1067.9492 1072.6505 1084.6816 1091.4315 1105.3637 1123.3824 1160.0657 1190.9040 1199.8751 1201.5268 1212.6391 1223.7620 1272.6325 1286.8154 1287.8055 1302.2826 1306.4108 1323.8506 1333.2857 1347.5794 1353.7836 1393.0351 1395.4850 1410.0329 1412.6062 1448.1072 1453.5838 1463.6533 1467.2256 1477.0055 1485.4882 1493.5038 1514.2668 1524.8445 1541.6624 1561.5287 1587.8629 1610.8573 2992.1058 3000.9886 3006.3984 3027.3562 3068.6249 3075.9381 3100.4269 3122.6703 3125.3943 3132.6117 3133.1951 3133.5551 3141.2700 3155.1418 3161.9996 3166.5072 3170.2681
redmass: 3.4960 4.8405 4.8617 4.4808 4.4926 3.6965 4.3420 3.7581 2.4550 3.1644 3.3098 2.8907 1.9467 2.4915 4.8106 5.5967 6.0148 4.9853 2.5470 5.3165 4.9681 3.1782 7.3236 3.1128 3.7648 3.7256 4.7332 5.4757 4.7716 6.8844 6.2241 6.8582 4.6637 5.1707 4.5483 4.9849 3.4745 2.6142 1.4624 1.5341 1.4221 3.0215 1.2502 1.4159 2.2975 1.4090 3.5513 2.7133 2.4545 1.2055 1.3828 1.4108 1.3658 3.1755 2.4692 2.3172 3.4543 1.8474 1.8782 3.3771 2.6170 1.5140 1.3047 2.5725 1.3327 1.2623 1.4194 1.2578 1.7685 1.3532 3.8106 1.4099 1.6272 2.3399 1.7528 1.2649 3.5610 2.7957 2.9468 3.6445 2.6574 2.0798 1.0532 1.0859 1.0955 1.1161 2.6677 1.1186 8.1377 6.5658 7.4140 6.9483 5.8243 6.1905 1.0640 1.0661 1.0291 1.0638 1.0994 1.0965 1.1051 1.1061 1.0878 1.0894 1.1011 1.0899 1.0873 1.0959 1.0948 1.0959 1.0964
irintensity: 3.1612 0.8324 1.0296 0.1724 1.1384 2.8384 0.9515 0.0927 1.2931 1.5936 2.3331 2.5046 1.6935 2.4670 1.3970 0.1988 1.4090 0.0817 1.2824 2.9196 2.1612 0.6060 11.1601 10.0420 16.5592 15.1953 4.4210 4.6617 12.8735 3.4713 4.5610 4.1316 4.5572 0.2645 3.1888 8.8456 0.9042 11.4197 57.5716 23.1461 29.2423 1.2602 0.5214 0.0553 3.7550 5.2867 5.4946 6.2535 2.9590 7.4578 3.6003 0.1002 13.5605 15.9237 0.2964 1.1959 17.4124 11.1411 8.9055 5.0084 34.5586 12.7891 2.0467 7.7395 1.2282 10.2283 4.4428 10.3691 4.8266 8.7767 3.3832 11.2840 22.8990 46.5496 11.6615 6.8202 11.1164 3.5688 10.1487 2.3110 33.3232 46.8991 15.3717 29.3050 8.2080 8.8337 56.4221 3.0189 45.9898 36.1568 14.5136 8.7463 214.1589 32.3840 46.3503 34.6532 26.7114 36.3605 14.9850 14.7292 36.4197 18.1246 19.2401 13.3035 7.2475 18.7834 6.7355 28.3320 14.5037 0.2189 3.7825
temp: 298.150 k
press: 1.00000 atm
elementType: 16 7 7 7 6 6 6 6 6 6 6 6 6 6 6 6 6 6 6 6 6 6 1 1 1 1 1 1 1 1 1 1 1 1 1 1 1 1 1
symmnumber: 1
zpe: 809114.3 jmol-1
zpe.correction: 0.308175 hartree
zpe.thermalcorrener: 0.327340 hartree
zpe.thermalcorrenthalpy: 0.328285 hartree
zpe.thermalcorrgfe: 0.258663 hartree
zpe.sumelectzpe: -1256.882840 hartree
zpe.sumelectthermal: -1256.863675 hartree
zpe.sumelectthermalent: -1256.862730 hartree
zpe.sumelectthermalfe: -1256.932352 hartree
dipole: -3.9536 -0.6010 -0.9593
dipole: 4.1125
quadrupole: -105.2338 -150.8743 -135.3011
quadrupole: 20.9844 1.1403 -5.5930
quadrupole: 25.2359 -20.4045 -4.8314 20.9844 1.1403 -5.5930
hfenergy: -1257.1910149 hartree
pointgroup: C01 [X(C18H17N3S1)]
dipole: 1.5468393 0.1584272 -0.447212 debye
polarizability: 357.7076585|-2.1086197|261.5759046|-29.1960364|37.7350557|142.4234458 unknown
InChI: InChI=1S/C18H17N3S/c1-22-15-6-4-13(5-7-15)17-18(14-8-10-19-11-9-14)21-12-2-3-16(21)20-17/h4-11H,2-3,12H2,1H3
charge 0 multiplicity 1
39 atoms
S  -5.703436 1.076952 0.68994
N  2.615485 0.610074 -0.17899
N  1.100594 2.212034 0.325865
N  1.068699 -4.38244 -0.520282
C  4.038249 0.276454 -0.384913
C  4.755474 1.55062 0.179302
C  3.697305 2.707721 0.124596
C  2.400609 1.94593 0.119787
C  1.376235 -0.057578 -0.144744
C  0.436606 0.973131 0.15729
C  1.261044 -1.514732 -0.290538
C  -1.034486 0.931354 0.255407
C  2.06837 -2.250736 -1.205474
C  0.356539 -2.271424 0.509513
C  -1.701461 1.919977 1.034488
C  -1.833103 -0.019514 -0.43349
C  -3.102431 1.937003 1.14488
C  -3.239753 -0.010357 -0.326616
C  1.938822 -3.653887 -1.282228
C  0.295266 -3.670956 0.359111
C  -3.886901 0.964799 0.469327
C  -6.331324 -0.339751 -0.367033
H  4.250977 0.12962 -1.460955
H  4.317341 -0.645277 0.152644
H  5.667508 1.786124 -0.392955
H  5.048801 1.369405 1.2278
H  3.803243 3.316559 -0.793412
H  3.778262 3.391389 0.985248
H  2.768275 -1.739878 -1.874837
H  -0.280234 -1.773056 1.24583
H  -1.097289 2.679206 1.540235
H  -1.360762 -0.767384 -1.078677
H  -3.590369 2.706365 1.754158
H  -3.815137 -0.759429 -0.879241
H  2.550116 -4.229983 -1.986618
H  -0.393518 -4.264409 0.970925
H  -7.427305 -0.314946 -0.265766
H  -5.949709 -1.303576 0.004761
H  -6.0566 -0.190906 -1.423039
