program: Gaussian 09
title: 000012048
version: EM64L-G09RevD.01
frameworkgroup: C1[X(C7H16)]
method: RPBEPBE
basis: SDD
operation: Freq
keyword: #p
keyword: freq=noraman
keyword: PBEPBE/SDD
title: #p freq=noraman PBEPBE/SDD
converged: YES YES NO NO
title: Mulliken charges:
elementType: C C C C C C C H H H H H H H H H H H H H H H H
charge: 0.047331 -0.391300 -0.421703 -0.391290 -0.714638 -0.719198 -0.714638 0.175602 0.192110 0.197874 0.206099 0.206094 0.197870 0.192108 0.218676 0.213487 0.209829 0.220362 0.212978 0.220359 0.213488 0.218673 0.209828
chargesum: 0.00000
title: Mulliken charges with hydrogens summed into heavy atoms:
elementType: C C C C C C C
charge: 0.222932 -0.001316 -0.009510 -0.001312 -0.072646 -0.065500 -0.072648
polarizability: 8.41388556e+01 -1.91151608e-04 7.53994206e+01 8.34777034e-05 3.11576943e-01 6.79644273e+01
1716.lowfreq: -39.2493 -39.1650 -13.4151 -0.0007 -0.0005 -0.0004 42.1590 88.9106 120.7270
frequency: 17.9394 88.9103 120.7121 191.0604 210.7579 214.4518 253.6445 278.8331 312.7678 386.3536 446.2183 514.3890 719.7139 738.5771 781.5728 828.0970 898.5417 902.1546 997.6737 1001.4022 1017.5285 1032.7771 1043.3239 1074.4489 1141.7345 1153.4458 1174.2456 1243.0995 1251.3144 1269.4560 1278.1895 1325.3826 1340.2090 1349.6140 1349.6282 1378.0589 1389.8074 1389.9947 1459.7855 1465.6297 1474.6953 1477.7016 1479.5310 1481.6428 1485.9773 1486.7397 1496.6671 2932.8525 2962.2837 2968.3412 2972.9269 2973.3837 2978.0579 2986.8740 3007.5724 3017.5905 3024.6341 3065.5896 3066.3834 3070.1929 3070.7338 3072.8503 3074.9523
redmass: 2.2653 2.2850 1.3245 1.9155 1.4260 1.0629 1.3838 1.9082 2.0211 3.2595 2.1199 2.0478 2.0724 1.1413 1.1967 1.3404 1.6942 1.9945 1.2204 1.6073 1.6197 2.4119 1.4352 2.8397 1.8824 1.9022 2.4048 1.2740 1.3198 1.1423 1.1582 1.4302 1.4394 1.3409 1.6195 1.2225 1.2108 1.2197 1.0678 1.0560 1.0636 1.0464 1.0615 1.0436 1.0484 1.0601 1.0673 1.0816 1.0591 1.0571 1.0369 1.0384 1.0368 1.0610 1.1008 1.0998 1.1000 1.0995 1.0991 1.0997 1.0988 1.0995 1.0999
irintensity: 0.0003 0.0232 0.0081 0.0450 0.0057 0.0002 0.0500 0.2257 0.0013 0.0797 0.4965 3.8167 4.3291 6.2858 2.8153 6.8870 14.7168 4.6030 3.0578 2.6462 1.1915 0.0392 8.9857 0.0717 1.8311 0.5634 1.7419 0.0145 0.5378 2.9579 0.0177 0.3618 0.0764 0.3810 0.0227 19.3820 21.1111 6.1609 2.0652 7.1135 15.4839 0.0111 30.6721 0.6739 3.7649 13.9286 9.0093 22.0039 3.1575 78.0087 51.3132 1.7091 48.1958 31.5188 0.1839 63.7945 28.2954 13.6395 74.2594 51.9459 67.3100 109.2386 31.5349
temp: 298.150 k
press: 1.00000 atm
elementType: 6 6 6 6 6 6 6 1 1 1 1 1 1 1 1 1 1 1 1 1 1 1 1
symmnumber: 1
zpe: 560208.9 jmol-1
zpe.correction: 0.213372 hartree
zpe.thermalcorrener: 0.223242 hartree
zpe.thermalcorrenthalpy: 0.224186 hartree
zpe.thermalcorrgfe: 0.178015 hartree
zpe.sumelectzpe: -275.729345 hartree
zpe.sumelectthermal: -275.719476 hartree
zpe.sumelectthermalent: -275.718531 hartree
zpe.sumelectthermalfe: -275.764703 hartree
dipole: 0.0000 -0.0965 0.0253
dipole: 0.0997
quadrupole: -48.2224 -47.3746 -47.6444
quadrupole: 0.0000 0.0001 -0.0030
quadrupole: -0.4753 0.3725 0.1028 0.0000 0.0001 -0.0030
hfenergy: -275.9427177 hartree
pointgroup: C01 [X(C7H16)]
dipole: 0.0000047 0.0375588 0.0113402 debye
dipolederiv: 0.0579273 0.0000022 0.000002 0.0000033 0.1263226 0.0420871 -0.0000053 0.0229663 0.0971468 0.0254064 -0.0091211 -0.0110275 -0.0120906 0.1074138 0.0427962 0.0169991 0.0469574 0.1086326 0.0878597 -0.0000028 -0.0000024 -0.0000052 0.0550897 0.0129128 0.0000057 0.0494755 0.0798931 0.0254148 0.0091344 0.0110323 0.0120991 0.1074116 0.0427827 -0.016985 0.0469589 0.108621 -0.0894152 -0.0151357 0.0449659 -0.010705 0.0827854 0.0208142 0.0182435 0.0196351 0.0593307 0.0898008 -0.0000226 -0.0000146 -0.0000253 -0.0361703 -0.0704435 -0.0000135 -0.0692599 -0.0219867 -0.0894075 0.0151499 -0.044965 0.0107214 0.082781 0.0208212 -0.0182358 0.0196389 0.0593254 0.0291383 -0.0000116 -0.000015 -0.0000131 -0.0654842 -0.1125586 -0.0000144 -0.1043565 -0.1645791 0.0276382 -0.0339606 0.0147025 -0.0115944 -0.2085746 0.077109 0.0119305 0.0523782 0.0548504 0.0195787 0.0086035 0.0295002 -0.0119382 0.0431092 -0.122092 0.0084684 -0.0906919 -0.1493451 -0.0916133 -0.0813705 0.1502685 -0.0710326 0.0168144 0.0065889 0.1281458 -0.009572 -0.034525 -0.0916107 0.0813959 -0.1502629 0.0710612 0.0167869 0.0066221 -0.1281425 -0.0095497 -0.0344968 0.0195801 -0.0085948 -0.0295094 0.0119495 0.0430891 -0.1221085 -0.0084771 -0.0907141 -0.1493246 0.0276471 0.0339207 -0.0146994 0.0115545 -0.2085672 0.0771379 -0.0119297 0.0524072 0.0548351 0.0891855 -0.0315443 0.0170829 -0.0739661 -0.1693271 0.0358744 0.0296734 0.0250668 0.0676409 -0.1447804 0.0817861 -0.0808616 0.1041845 0.0494396 0.0478039 -0.1160699 0.0606379 0.0266305 0.0758039 -0.0254483 -0.026765 -0.0008916 0.0420794 -0.096666 0.0452811 -0.0968492 -0.1432972 -0.0887235 0.0110955 -0.1244978 0.0441734 0.0992917 0.0327146 -0.1156087 0.0044901 -0.0185352 0.0890686 -0.0000243 0.0000014 -0.0000275 -0.205797 0.0381035 0.0000043 0.0770679 0.0667754 -0.0886917 -0.0110551 0.1245156 -0.044128 0.0993053 0.0326984 0.1156204 0.0044653 -0.018575 -0.1448152 -0.0817488 0.0808723 -0.1041425 0.0494831 0.0477855 0.1160841 0.0606139 0.0266224 0.0891995 0.031502 -0.0170806 0.0739279 -0.1693354 0.0359117 -0.0296849 0.0251022 0.0676338 0.0758087 0.0254503 0.0267575 0.0008853 0.0420527 -0.0966957 -0.0452896 -0.0968683 -0.1432736 unknown
polarizability: 84.1388556|-0.0004291|75.4122974|0.0001896|-0.0342875|67.9515505 unknown
InChI: InChI=1S/C7H16/c1-4-7(5-2)6-3/h7H,4-6H2,1-3H3
charge 0 multiplicity 1
23 atoms
C  0.000048 0.386339 0.308799
C  -1.272297 0.839003 -0.46273
C  -0.000116 -1.134576 0.644427
C  1.272487 0.838733 -0.462738
C  -2.603674 0.574208 0.27398
C  -0.00031 -2.08025 -0.579574
C  2.603801 0.573844 0.274053
H  0.00011 0.925476 1.283487
H  -1.183535 1.92651 -0.663356
H  -1.295199 0.348613 -1.457299
H  -0.882554 -1.361266 1.274281
H  0.88234 -1.361479 1.274178
H  1.295358 0.348225 -1.45725
H  1.183885 1.926229 -0.663491
H  -2.798424 -0.506931 0.395362
H  -3.456827 1.00475 -0.282295
H  -2.595029 1.029095 1.283033
H  -0.893044 -1.926308 -1.212943
H  -0.00039 -3.137165 -0.255112
H  0.892349 -1.926495 -1.213096
H  3.457035 1.004189 -0.28225
H  2.7984 -0.507305 0.395586
H  2.595186 1.028863 1.283047
