program: Gaussian 09
title: 000129710
version: EM64L-G09RevD.01
frameworkgroup: C1[X(C17H16ClN5O2)]
method: RPBEPBE
basis: SDD
operation: Freq
keyword: #p
keyword: freq=noraman
keyword: PBEPBE/SDD
title: #p freq=noraman PBEPBE/SDD
converged: YES YES NO NO
title: Mulliken charges:
elementType: Cl O O N N N N N C C C C C C C C C C C C C C C C C H H H H H H H H H H H H H H H H
charge: -0.006257 -0.209633 -0.242954 -0.284565 -0.100560 -0.044613 -0.169720 -0.007362 0.326050 -0.569457 0.364205 -0.122540 0.239742 0.145908 -0.259322 0.022754 -0.374925 -0.622481 -0.207924 -0.289355 0.262304 -0.216289 -0.251419 -0.683055 -0.682578 0.301954 0.270277 0.280318 0.263370 0.244383 0.277617 0.243660 0.229794 0.244238 0.265884 0.231456 0.225633 0.224352 0.225791 0.224703 0.230617
chargesum: 0.00000
title: Mulliken charges with hydrogens summed into heavy atoms:
elementType: Cl O O N N N N N C C C C C C C C C C C C C C C C C
charge: -0.006257 -0.209633 -0.242954 -0.284565 -0.100560 -0.044613 -0.169720 -0.007362 0.326050 0.002773 0.364205 -0.122540 0.239742 0.145908 0.020996 0.022754 -0.111555 0.128589 0.036459 -0.289355 0.262304 0.027949 0.014465 -0.001614 -0.001467
polarizability: 3.43042587e+02 -4.41935520e+00 2.40846195e+02 -1.47128110e+01 6.24652058e-01 1.42118411e+02
1716.lowfreq: -7.9201 -6.0995 -1.1844 0.0013 0.0014 0.0019 5.6950 25.4447 38.0905
frequency: -4.6943 25.4360 38.0663 42.9801 65.1619 84.7754 89.9811 95.7471 128.2763 138.5302 156.9114 185.5133 190.8951 202.3235 204.3064 218.7973 238.1458 250.7827 291.8640 302.4835 314.8243 327.2734 347.3974 370.2691 384.1462 400.9807 422.0247 427.8739 441.2699 459.3970 472.0374 528.8775 558.2607 588.0069 643.3027 651.7866 653.9912 671.3991 683.6297 700.5375 721.4831 748.8195 761.5661 762.4767 770.0910 786.5389 796.1439 802.8863 881.5467 897.7224 898.3877 902.1343 919.6925 927.9147 933.6863 960.8779 977.0653 986.8610 1035.0317 1055.8453 1079.6323 1085.8875 1104.5784 1108.8999 1117.4405 1125.9882 1145.6066 1154.5158 1179.1342 1184.2279 1203.7359 1217.0905 1248.1770 1252.2089 1270.8152 1298.3496 1310.7753 1325.4974 1354.8355 1362.4022 1376.6416 1378.8992 1385.8273 1397.1488 1418.1786 1423.0750 1436.4071 1450.3145 1460.7421 1463.8910 1467.4524 1470.2138 1477.1027 1480.9889 1484.2447 1486.4965 1538.6600 1564.5307 1585.4780 1599.9601 1610.9208 2981.1762 2988.4402 2989.8642 2999.1104 3023.6919 3063.7901 3088.7127 3091.6909 3092.3400 3098.7733 3106.6761 3120.8632 3150.1547 3166.6075 3182.6568 3242.6835
redmass: 2.8293 4.3650 10.3909 6.0244 6.4544 6.3721 3.8447 4.4377 1.1046 3.8468 5.6424 5.4905 4.9423 2.1861 1.3242 4.5649 3.9045 1.5099 4.1522 4.1092 4.0416 5.7143 4.4131 4.8011 4.5910 6.6585 5.3992 5.5945 4.9480 3.6726 5.4935 4.4128 4.6328 5.2844 7.6994 3.9085 5.9995 3.6044 5.5053 7.8143 6.4320 7.9956 7.9204 2.4757 4.7218 6.0117 2.2468 1.8221 2.9675 5.2378 5.1354 1.4107 4.2817 1.1611 4.6724 1.4815 1.3455 3.4364 3.3600 3.2322 2.0277 2.3852 2.4954 2.5837 1.8738 1.7646 4.0088 1.8133 1.9756 1.7216 2.0429 2.5806 2.2952 2.1852 3.5293 1.3194 4.1371 1.4434 6.5780 1.8197 4.2496 1.1860 2.4511 1.2200 1.3027 3.0834 3.1185 3.7301 3.5681 1.0714 1.2186 1.0605 1.0655 1.1307 1.1049 1.1095 5.9608 6.9919 7.6358 7.7390 10.1939 1.0346 1.0345 1.0350 1.0673 1.0846 1.1020 1.1010 1.1013 1.1003 1.1002 1.0968 1.0990 1.0873 1.0935 1.0990 1.0988
irintensity: 0.1486 0.4902 1.8697 0.3428 1.8997 1.8948 1.1753 0.1284 0.2234 1.3632 0.6828 1.7325 2.4295 3.1191 1.2805 2.3007 1.1016 1.1154 4.2625 0.5918 3.7034 0.3389 1.9524 3.4810 13.5749 4.2719 0.2373 4.3020 7.5536 0.1560 1.8787 0.1972 2.2895 1.0467 2.9359 4.4055 7.4864 1.1668 19.9693 1.1547 11.7838 4.7464 33.3133 23.7278 23.4101 41.7340 56.0331 3.6402 0.9688 6.1744 11.6797 0.1125 9.1408 4.2438 15.7627 0.2565 0.7723 21.7135 66.7388 4.9129 12.6263 18.0696 47.5218 3.0070 6.3894 7.6321 105.6721 8.1291 2.1556 33.6540 41.2512 42.9168 14.5137 18.5701 14.2395 0.0270 3.2096 17.7441 1.8913 4.1401 5.0914 13.3588 73.7339 15.5068 52.9167 5.5321 7.1748 278.6897 31.4622 10.0843 10.7001 1.4257 11.6700 18.1646 14.4226 3.9778 139.7847 22.5870 152.1274 267.6945 30.3520 41.7334 23.8065 21.7657 17.8365 3.9566 23.1324 10.7312 9.0452 46.5453 56.8004 5.7911 0.9027 4.8601 3.5236 5.5108 0.4552
temp: 298.150 k
press: 1.00000 atm
elementType: 17 8 8 7 7 7 7 7 6 6 6 6 6 6 6 6 6 6 6 6 6 6 6 6 6 1 1 1 1 1 1 1 1 1 1 1 1 1 1 1 1
symmnumber: 1
zpe: 807474.8 jmol-1
zpe.correction: 0.307551 hartree
zpe.thermalcorrener: 0.329168 hartree
zpe.thermalcorrenthalpy: 0.330112 hartree
zpe.thermalcorrgfe: 0.256236 hartree
zpe.sumelectzpe: -1539.857822 hartree
zpe.sumelectthermal: -1539.836205 hartree
zpe.sumelectthermalent: -1539.835261 hartree
zpe.sumelectthermalfe: -1539.909137 hartree
dipole: 0.0871 -1.5125 4.4666
dipole: 4.7166
quadrupole: -138.3436 -157.2679 -156.3890
quadrupole: -39.4284 -4.7174 1.9433
quadrupole: 12.3232 -6.6011 -5.7222 -39.4284 -4.7174 1.9433
hfenergy: -1540.165373 hartree
pointgroup: C01 [X(C17H16Cl1N5O2)]
dipole: 0.0693867 -0.5241297 1.7787333 debye
polarizability: 342.9704627|-1.4951461|240.5205768|-16.3311888|-3.7348107|142.5161534 unknown
InChI: InChI=1S/C17H16ClN5O2/c1-9(2)16-20-15(21-25-16)14-12-7-22(3)17(24)13-10(18)5-4-6-11(13)23(12)8-19-14/h4-6,8-9H,7H2,1-3H3
charge 0 multiplicity 1
41 atoms
Cl -4.744263 -2.522667 0.521964
O  4.675889 1.224642 -0.369442
O  -2.571711 -2.161568 -1.680953
N  -1.180515 1.320896 -0.239418
N  -0.747432 -1.690625 -0.302334
N  0.552331 2.614803 -0.930065
N  2.947295 -0.115676 0.222312
N  3.442985 1.996353 -0.652174
C  -0.008525 0.605437 0.073746
C  -0.121292 -0.764072 0.676579
C  -2.510015 0.910218 0.107766
C  1.048932 1.420517 -0.361063
C  -2.891481 -0.464471 0.013621
C  -2.056619 -1.508079 -0.723444
C  -0.779194 2.526268 -0.839846
C  2.470237 1.124995 -0.271798
C  -3.412082 1.897683 0.571058
C  0.134135 -2.618308 -1.034935
C  5.3300 -1.011547 0.521816
C  -4.194055 -0.792363 0.472657
C  4.270116 -0.014422 0.146407
C  -4.712466 1.531104 0.963616
C  -5.10373 0.174681 0.939079
C  5.200714 -2.289602 -0.350116
C  5.24286 -1.345651 2.035352
H  0.887342 -1.130097 0.917054
H  -0.722981 -0.742765 1.605111
H  -1.48689 3.259266 -1.217951
H  -3.080271 2.937004 0.652526
H  6.306003 -0.534202 0.31505
H  -0.466449 -3.125813 -1.805108
H  0.963309 -2.06738 -1.516431
H  0.557664 -3.368774 -0.343301
H  -5.412986 2.292347 1.320288
H  -6.095366 -0.131657 1.282227
H  5.289318 -2.055898 -1.425583
H  5.999882 -3.00409 -0.084578
H  4.224544 -2.777134 -0.179518
H  4.264242 -1.796793 2.275798
H  6.036547 -2.064924 2.304699
H  5.370178 -0.441736 2.656534
