program: Gaussian 09
title: 000129696
version: EM64L-G09RevD.01
frameworkgroup: C1[X(C16H15N3O2)]
method: RPBEPBE
basis: SDD
operation: Freq
keyword: #p
keyword: freq=noraman
keyword: PBEPBE/SDD
title: #p freq=noraman PBEPBE/SDD
converged: YES YES NO NO
title: Mulliken charges:
elementType: O O N N N C C C C C C C C C C C C C C C C H H H H H H H H H H H H H H H
charge: -0.274661 -0.282266 -0.270654 -0.113586 -0.079439 -0.322336 -0.475925 -0.476004 0.154564 -0.104175 0.339006 -0.565165 0.339701 -0.271460 0.119795 0.150732 -0.352554 -0.625662 -0.336965 -0.227575 -0.242300 0.289156 0.245221 0.259685 0.259541 0.245014 0.304607 0.264602 0.277976 0.255579 0.232614 0.248188 0.275487 0.279330 0.239236 0.240692
chargesum: 0.00000
title: Mulliken charges with hydrogens summed into heavy atoms:
elementType: O O N N N C C C C C C C C C C C C C C C C
charge: -0.274661 -0.282266 -0.270654 -0.113586 -0.079439 -0.033180 0.028980 0.028551 0.154564 -0.104175 0.339006 0.004044 0.339701 0.006516 0.119795 0.150732 -0.096975 0.130627 -0.057636 0.011661 -0.001608
polarizability: 3.06625761e+02 -1.27195970e+01 1.96269211e+02 2.41035968e+00 3.87696929e+00 1.14600486e+02
1716.lowfreq: -8.7976 -3.8455 -0.0009 -0.0004 0.0005 3.5999 31.2768 48.8134 64.8187
frequency: 31.2622 48.7882 64.8085 69.1766 84.6934 100.3304 117.3445 124.5432 166.1519 204.9020 217.7265 225.5917 257.5230 277.8485 287.4205 312.6950 333.4525 368.5929 379.2192 409.8898 440.4286 472.2411 504.1927 523.2358 570.8835 629.6014 648.5740 655.9059 665.3087 684.4642 706.4915 736.6251 748.5602 764.7975 771.8197 782.0537 790.6858 797.5572 805.0253 855.4457 884.8831 890.0922 900.8253 914.5468 961.7997 967.5781 996.4376 998.0203 1037.0796 1042.0576 1070.4470 1072.8631 1078.9247 1087.7081 1109.9778 1121.4295 1127.7251 1152.9740 1178.1498 1181.4160 1182.6588 1195.0548 1218.4009 1234.6361 1246.1990 1267.9862 1287.7560 1318.6237 1328.4354 1365.2037 1385.9682 1387.3485 1405.5535 1421.0515 1423.3977 1428.2901 1443.9497 1454.8642 1468.4386 1478.0459 1479.9043 1489.1415 1551.9761 1561.8304 1564.0516 1586.3119 1611.8561 2982.5975 2985.0822 3065.9640 3099.5309 3101.3908 3106.3479 3124.0001 3139.8133 3151.7927 3164.1569 3173.4995 3176.8976 3206.0229 3224.9713 3241.6494
redmass: 4.7763 3.9498 5.6205 3.7594 4.0329 4.3699 1.4379 2.1324 4.6036 5.3427 5.6731 4.2250 3.6494 4.7807 3.3959 4.5552 4.5775 4.8228 4.9399 4.0745 4.5529 7.1845 4.0905 4.3648 4.3664 6.3859 6.3311 4.1795 5.2144 4.9688 2.8935 4.8367 5.8494 2.5349 3.6068 1.7029 2.1345 1.2021 1.9680 5.0895 1.4940 1.5512 3.8663 4.0827 2.5021 1.4167 2.4710 1.7966 2.4420 1.2787 1.7824 1.9570 1.3015 1.9750 1.0942 1.3276 2.0112 2.3152 1.2228 1.3913 2.5347 2.0913 2.4261 2.3548 2.3763 2.0626 1.5445 2.4381 1.8185 6.8209 4.6540 2.4951 2.3634 1.3137 1.0885 2.8538 1.4513 3.0852 1.1162 1.1804 2.5591 1.1291 7.2134 6.7415 8.3073 7.2927 6.4428 1.0411 1.0616 1.1015 1.0497 1.0958 1.0611 1.0992 1.0861 1.0903 1.0949 1.0919 1.1002 1.1183 1.1158 1.0987
irintensity: 0.6940 2.3327 4.8617 0.5481 3.7510 2.2697 0.3321 0.4778 4.0195 0.4568 0.5901 2.2595 4.9152 8.5011 2.1293 1.6966 1.2479 21.5707 3.1795 6.6669 2.3761 0.3074 8.4728 4.8130 1.9243 2.1632 9.2630 3.6736 3.4814 19.9100 16.8006 3.9219 10.2275 39.0283 5.3142 49.3139 1.3702 3.9108 10.3066 0.4263 0.2703 5.4971 5.2791 82.9206 54.5561 6.1253 70.8103 55.9987 24.5326 18.6963 13.3908 42.7413 9.4254 9.3021 3.6362 0.7384 8.4646 27.5453 7.4868 0.7229 29.3554 4.5172 66.6216 59.6011 9.8424 6.4583 16.9472 7.5823 26.9984 1.3948 105.2056 59.0915 148.6826 65.4249 11.7984 11.5486 51.2347 130.8832 27.1527 17.1558 47.0073 3.0167 158.8764 251.1907 48.1777 130.7905 22.9580 38.0151 24.6303 22.6716 17.3752 7.5777 12.7170 1.3200 1.8268 9.9574 5.9122 1.9692 17.6622 0.2044 11.8426 0.4689
temp: 298.150 k
press: 1.00000 atm
elementType: 8 8 7 7 7 6 6 6 6 6 6 6 6 6 6 6 6 6 6 6 6 1 1 1 1 1 1 1 1 1 1 1 1 1 1 1
symmnumber: 1
zpe: 736549.4 jmol-1
zpe.correction: 0.280537 hartree
zpe.thermalcorrener: 0.298458 hartree
zpe.thermalcorrenthalpy: 0.299402 hartree
zpe.thermalcorrgfe: 0.233886 hartree
zpe.sumelectzpe: -931.902880 hartree
zpe.sumelectthermal: -931.884960 hartree
zpe.sumelectthermalent: -931.884015 hartree
zpe.sumelectthermalfe: -931.949532 hartree
dipole: 1.5203 -2.9648 1.6760
dipole: 3.7297
quadrupole: -114.4920 -117.9025 -125.8029
quadrupole: -11.0704 9.6931 2.9110
quadrupole: 4.9071 1.4966 -6.4038 -11.0704 9.6931 2.9110
hfenergy: -932.1834172 hartree
pointgroup: C01 [X(C16H15N3O2)]
dipole: -0.5506267 1.0664133 0.8442369 debye
polarizability: 305.6189524|-12.8117952|195.9345956|-12.9550273|8.3577371|115.9419099 unknown
InChI: InChI=1S/C16H15N3O2/c1-18-8-13-14(15(20)10-6-7-10)17-9-19(13)12-5-3-2-4-11(12)16(18)21/h2-5,9-10H,6-8H2,1H3
charge 0 multiplicity 1
36 atoms
O  3.121298 -1.253221 0.507596
O  -2.787927 -2.289599 -1.328533
N  -0.484502 1.03521 -0.060075
N  -0.797447 -2.012559 -0.150867
N  1.538421 1.884744 -0.64394
C  4.221034 0.7019 -0.409314
C  5.408613 -0.098153 -1.01091
C  5.541713 0.485674 0.380612
C  3.026089 -0.069242 0.031813
C  1.707915 0.587072 -0.101689
C  0.459477 0.053158 0.261871
C  0.014232 -1.256473 0.835347
C  -1.897192 0.939222 0.178271
C  0.223272 2.124127 -0.60546
C  -2.607989 -0.286025 0.001919
C  -2.059125 -1.594472 -0.547512
C  -2.578635 2.115018 0.583032
C  -0.214726 -3.240374 -0.725367
C  -4.010689 -0.276175 0.227776
C  -3.967297 2.092746 0.809792
C  -4.68852 0.8883 0.634313
H  4.014564 1.697311 -0.807116
H  5.944229 0.369968 -1.841029
H  5.257099 -1.178574 -1.085595
H  5.477391 -0.209855 1.222047
H  6.170779 1.366514 0.534289
H  0.913338 -1.841175 1.080547
H  -0.57247 -1.100455 1.76217
H  -0.272199 3.014532 -0.983061
H  -2.009882 3.037184 0.740298
H  -0.095942 -4.017248 0.052723
H  0.77555 -3.022161 -1.16362
H  -0.89764 -3.612807 -1.503663
H  -4.554187 -1.20739 0.041857
H  -4.480384 3.006387 1.12739
H  -5.76906 0.860892 0.806688
