program: Gaussian 09
title: 000129752
version: EM64L-G09RevD.01
frameworkgroup: C1[X(C21H23N7O5)]
method: RPBEPBE
basis: SDD
operation: Freq
keyword: #p
keyword: freq=noraman
keyword: PBEPBE/SDD
title: #p freq=noraman PBEPBE/SDD
converged: YES YES NO NO
title: Mulliken charges:
elementType: O O O O O N N N N N N N C C C C C C C C C C C C C C C C C C C C C H H H H H H H H H H H H H H H H H H H H H H H
charge: -0.284569 -0.398334 -0.240764 -0.416084 -0.226216 -0.447944 -0.059561 0.049687 -0.026516 -0.087497 -0.611040 -0.580678 -0.211641 -0.598385 0.526828 0.311701 -0.722389 -0.138552 -0.390136 -0.434623 -0.418343 0.278733 -0.345374 -0.364935 0.153034 -0.474477 -0.485669 -0.104712 0.116477 -0.041987 0.131553 0.181151 -0.034996 0.229213 0.226535 0.215465 0.228756 0.228288 0.220546 0.308903 0.285940 0.248977 0.243304 0.235521 0.346147 0.210754 0.275545 0.271318 0.256229 0.249711 0.389927 0.330819 0.347442 0.378759 0.330670 0.337490
chargesum: 0.00000
title: Mulliken charges with hydrogens summed into heavy atoms:
elementType: O O O O O N N N N N N N C C C C C C C C C C C C C C C C C C C C C
charge: -0.284569 -0.008407 -0.240764 -0.037325 -0.226216 -0.101797 -0.059561 0.049687 -0.026516 -0.087497 0.067220 0.087482 0.017572 -0.156385 0.526828 0.311701 -0.044800 0.170351 0.144781 -0.191319 -0.182822 0.278733 -0.134620 -0.089390 0.153034 -0.224766 0.041879 -0.104712 0.116477 -0.041987 0.131553 0.181151 -0.034996
polarizability: 3.20529053e+02 4.09249165e+00 3.50074752e+02 -3.17831051e+01 -3.74280663e+01 2.43301676e+02
1716.lowfreq: -6.7282 -3.2991 -0.0005 0.0003 0.0004 1.9829 8.6699 10.0919 16.1360
frequency: 8.4719 8.8593 14.8450 16.7396 20.4196 32.0835 36.9265 48.6410 52.5707 60.8491 74.0157 77.1413 92.7664 102.3516 126.6069 139.2084 153.0767 166.7306 185.8584 195.1266 206.8330 212.9748 223.9673 236.5748 246.7539 275.5492 290.1114 310.6280 317.0248 340.4432 362.4115 394.2171 401.9423 423.1547 429.7618 430.3047 446.3379 461.0761 471.6726 483.9458 503.7624 508.7257 524.4310 538.0107 543.8861 546.0349 558.8173 564.0686 586.2166 591.0607 601.0613 605.0132 621.5388 631.4934 634.0173 637.1465 637.4670 639.1577 657.6355 692.3198 712.2752 726.9470 747.0905 754.8473 767.9098 792.2007 808.7122 819.6952 826.3325 839.7905 867.2449 876.8296 891.8227 900.2273 904.5842 912.6070 928.7830 935.0167 943.2158 963.1757 997.8026 1011.8121 1024.6750 1031.4077 1039.1645 1045.1558 1062.5852 1069.2081 1095.5354 1098.5967 1101.0536 1104.4673 1120.7876 1134.8024 1156.0002 1166.8518 1185.6718 1197.8968 1210.2993 1219.1232 1223.4888 1242.8251 1257.1303 1263.1099 1275.9531 1279.6259 1281.4750 1288.4273 1306.8906 1318.7380 1336.4414 1339.8642 1356.0183 1358.7186 1375.3083 1381.1185 1382.5474 1383.9597 1408.3668 1413.2449 1440.4497 1449.4341 1466.3487 1467.2504 1472.2518 1474.8064 1477.5653 1484.7175 1503.8575 1512.5972 1527.7614 1555.1458 1559.8624 1595.8660 1598.9882 1620.2574 1621.3946 1646.5960 1669.3141 2980.7648 2990.2400 2991.5742 2994.9709 3007.4542 3034.5771 3041.1273 3055.0638 3079.1058 3086.5023 3100.4214 3116.7013 3116.9128 3120.4634 3143.1308 3160.8777 3513.8890 3517.9176 3521.4961 3526.2382 3556.6829 3684.1701 3717.4948
redmass: 6.8124 7.4263 7.8202 9.7871 7.7901 3.9876 6.8233 6.0076 9.4295 6.6671 5.2565 5.5369 2.6748 5.4521 3.6610 5.8471 5.9569 5.1748 5.2487 3.2236 6.4837 2.5531 1.6019 3.9378 3.5884 4.6159 3.5805 3.5215 3.6439 4.2368 3.7528 4.0653 3.0537 4.6224 4.5887 4.7303 4.2122 4.2775 4.0024 1.2012 1.8352 6.8075 3.3441 3.8199 5.0990 1.4268 1.1122 2.5898 3.0194 4.3271 1.8406 2.3461 1.0916 3.4492 5.8801 1.3929 4.5642 1.8318 5.7341 3.8932 8.3234 4.5787 7.2450 3.6728 1.9110 3.0030 5.7932 3.7901 10.0680 1.5775 1.6756 4.0023 1.8977 4.3538 2.4804 2.1325 1.6200 2.7615 2.5056 1.3941 1.3704 3.0536 2.7143 2.3729 2.7401 2.7761 2.1799 2.6080 2.0048 2.5576 2.6547 2.8398 1.5201 2.2547 2.0183 1.3129 1.4495 1.1766 2.1200 1.9431 1.7499 1.4331 4.2063 1.7461 1.5829 1.7077 2.7694 1.2046 1.3472 1.3505 1.4889 3.2611 2.4471 1.7174 8.2367 2.4192 2.1403 1.3673 3.1876 3.7882 1.0955 4.9318 1.0691 1.1136 1.7708 1.2026 2.0748 1.3450 2.9208 2.5823 4.1730 7.4278 2.6886 7.2208 1.8465 3.0534 3.5071 8.4487 8.2621 1.0355 1.0651 1.0606 1.0782 1.0816 1.0627 1.0975 1.1023 1.1001 1.1001 1.1037 1.0896 1.0898 1.0897 1.0959 1.0948 1.0640 1.0643 1.0446 1.0772 1.0441 1.1048 1.1060
irintensity: 0.4323 0.7811 0.3699 0.7834 0.2340 0.1661 1.4631 0.6971 0.0448 0.9266 1.3461 4.4099 1.1241 0.4518 0.5840 0.4434 4.1670 5.6868 9.8314 1.8795 6.1098 5.3037 1.3037 3.0112 0.8863 3.2177 8.1978 7.6195 0.6530 0.5788 8.4811 2.5239 1.1420 20.0242 2.1346 7.1837 5.6410 4.7591 11.3619 214.7237 42.2220 0.0944 7.6106 52.4699 2.1980 268.6897 9.5790 104.2701 27.5733 3.0424 13.7747 53.9278 47.3965 17.1282 3.3093 115.5780 14.0392 81.6867 0.7048 55.5009 4.9332 12.0986 16.9159 19.1071 25.7911 22.3179 1.0112 15.1398 6.8860 11.5027 12.5879 14.6160 2.3832 14.0055 3.4636 4.0368 13.4680 4.3040 7.8337 0.2603 2.1536 4.1027 107.3108 17.3788 8.1389 227.1068 142.6969 2.5178 28.6888 24.7011 52.0230 48.2173 10.2725 2.0985 4.0736 7.3395 4.2720 19.0427 25.8968 1.1187 2.4674 11.4947 7.4946 47.4563 4.9128 9.7533 21.1965 8.2668 3.4834 3.9803 44.7051 7.0260 195.2380 7.3748 94.0331 18.5433 41.6710 5.6546 3.8273 133.2464 29.9064 91.7894 4.9586 23.9855 62.8020 8.6851 337.0182 6.6151 97.2804 94.2584 74.6297 140.9389 284.0404 106.6337 838.8297 198.8950 89.6376 144.7348 215.7041 33.3673 31.6505 8.4116 24.4411 13.9186 10.5631 5.7503 12.5903 43.3965 25.2088 8.9832 19.7625 21.6317 17.7262 14.2291 3.4153 22.6712 47.5521 76.6453 35.2346 177.2546 70.0693 50.0198
temp: 298.150 k
press: 1.00000 atm
elementType: 8 8 8 8 8 7 7 7 7 7 7 7 6 6 6 6 6 6 6 6 6 6 6 6 6 6 6 6 6 6 6 6 6 1 1 1 1 1 1 1 1 1 1 1 1 1 1 1 1 1 1 1 1 1 1 1
symmnumber: 1
zpe: 1130881.0 jmol-1
zpe.correction: 0.430730 hartree
zpe.thermalcorrener: 0.462154 hartree
zpe.thermalcorrenthalpy: 0.463098 hartree
zpe.thermalcorrgfe: 0.360849 hartree
zpe.sumelectzpe: -1571.099185 hartree
zpe.sumelectthermal: -1571.067761 hartree
zpe.sumelectthermalent: -1571.066817 hartree
zpe.sumelectthermalfe: -1571.169065 hartree
dipole: 4.0913 1.3876 -4.3888
dipole: 6.1584
quadrupole: -181.2807 -174.5854 -185.5026
quadrupole: -24.5848 1.6097 -8.5056
quadrupole: -0.8245 5.8709 -5.0464 -24.5848 1.6097 -8.5056
hfenergy: -1571.5299144 hartree
pointgroup: C01 [X(C21H23N7O5)]
dipole: -1.6036417 0.5357696 1.7354372 debye
polarizability: 320.3752377|-3.5211028|349.2867275|-31.7544399|38.7593148|244.2435158 unknown
InChI: InChI=1S/C21H23N7O5/c1-10(14-9-24-18-16(25-14)17(22)27-21(23)28-18)8-11-2-4-12(5-3-11)19(31)26-13(20(32)33)6-7-15(29)30/h2-5,9-10,13,26,29,32H,6-8,22-23H2,1H3
charge 0 multiplicity 1
56 atoms
O  3.883149 -2.609115 -0.166894
O  6.318936 1.003496 2.463942
O  4.035375 1.326268 2.732538
O  4.867206 3.09666 -2.60716
O  6.284802 1.272635 -2.842274
N  3.430994 -0.620351 0.924814
N  -4.078686 -0.502115 0.056286
N  -2.945588 1.127249 -2.020241
N  -3.657444 3.084554 -0.86844
N  -4.861927 2.878081 1.287001
N  -5.322206 0.759592 2.210206
N  -4.386413 4.949826 0.328594
C  -3.407963 -2.583764 -1.102458
C  -2.687096 -3.198983 0.144093
C  -1.215209 -2.831342 0.230309
C  -3.464498 -1.06591 -1.015856
C  -4.835241 -3.174584 -1.244911
C  4.854559 -0.292975 1.051643
C  5.502311 0.200113 -0.279533
C  -0.77372 -1.74781 1.032771
C  -0.242972 -3.553487 -0.51165
C  1.55351 -2.111332 0.336101
C  0.589312 -1.389532 1.087074
C  1.118972 -3.203174 -0.458335
C  3.028794 -1.81188 0.343388
C  -2.903639 -0.221652 -2.034361
C  4.838414 1.470933 -0.836428
C  -4.135802 0.86571 0.095703
C  4.987031 0.745201 2.159801
C  -3.581408 1.714525 -0.931905
C  -4.785985 1.532148 1.219604
C  5.425013 1.883669 -2.171992
C  -4.290013 3.584091 0.231004
H  -2.821964 -2.84899 -2.004877
H  -3.227271 -2.855795 1.045773
H  -2.79841 -4.298878 0.085355
H  -5.34643 -2.774416 -2.138785
H  -5.445452 -2.917922 -0.360436
H  -4.794336 -4.275558 -1.335528
H  5.406433 -1.20608 1.349349
H  5.417233 -0.625932 -1.005094
H  6.578066 0.372463 -0.101979
H  -1.505308 -1.18521 1.624104
H  -0.558967 -4.405123 -1.127066
H  2.771113 0.017311 1.37707
H  0.87978 -0.558501 1.741157
H  1.877494 -3.763553 -1.014646
H  3.751071 1.317091 -0.979777
H  4.93384 2.332598 -0.147389
H  -2.395126 -0.679504 -2.892011
H  6.374209 1.689885 3.182918
H  -5.786263 1.19895 3.001601
H  -5.254888 -0.253866 2.115977
H  5.255282 3.335906 -3.492497
H  -4.851409 5.360615 1.133372
H  -3.988166 5.521968 -0.411624
