program: Gaussian 09
title: 000129677
version: EM64L-G09RevD.01
frameworkgroup: C1[X(C10H11F2NO4)]
method: RPBEPBE
basis: SDD
operation: Freq
keyword: #p
keyword: freq=noraman
keyword: PBEPBE/SDD
title: #p freq=noraman PBEPBE/SDD
converged: YES YES NO NO
title: Mulliken charges:
elementType: F F O O O O N C C C C C C C C C C H H H H H H H H H H H
charge: -0.194531 -0.177195 -0.436921 -0.179563 -0.492892 -0.430061 -0.599296 0.159639 -0.620103 0.557623 0.042327 0.149835 -0.498818 -0.420373 0.170865 -0.329235 0.140359 0.234046 0.226291 0.228609 0.298066 0.295649 0.237006 0.240555 0.250679 0.386669 0.376158 0.384611
chargesum: 0.00000
title: Mulliken charges with hydrogens summed into heavy atoms:
elementType: F F O O O O N C C C C C C C C C C
charge: -0.194531 -0.177195 -0.050253 -0.179563 -0.116734 -0.045450 -0.005580 0.159639 -0.159765 0.557623 0.270936 0.149835 -0.261812 -0.179817 0.170865 -0.078556 0.140359
polarizability: 1.58831384e+02 -4.88035666e+00 1.31511132e+02 -2.10900242e+01 2.74160810e+00 9.01990445e+01
1716.lowfreq: -8.0569 -4.3291 -0.0005 -0.0004 -0.0002 1.6899 10.9073 41.9834 63.6756
frequency: 4.1566 41.9731 63.6573 70.6077 98.3197 134.8197 160.0475 165.0987 207.5837 244.3330 262.4011 275.6116 280.9184 283.0877 317.0488 335.4011 347.1796 358.9171 430.6774 440.2980 466.1936 468.1624 497.0402 503.7774 543.1159 571.1509 577.9577 603.0155 633.2839 686.4162 703.3406 710.8130 725.1121 750.1208 776.5399 820.0292 850.2077 884.0543 937.1745 943.4924 951.4351 972.9312 1012.4428 1023.6727 1075.9785 1100.6710 1125.7917 1135.5115 1161.5007 1185.4821 1203.1629 1234.4099 1261.9681 1284.6647 1301.1411 1308.8380 1318.3959 1343.7625 1360.1143 1415.4246 1437.3383 1454.7336 1523.3941 1615.5837 1627.3764 1645.8989 1673.0086 2999.2267 3061.0871 3071.9984 3137.7569 3142.3241 3172.2974 3454.9288 3521.0738 3525.7046 3583.6675 3621.5755
redmass: 6.4050 9.5254 6.6009 7.5525 12.6459 7.3716 7.7535 7.9400 6.1930 5.1259 3.3395 2.3611 1.6453 3.3130 4.2132 3.5638 2.2371 1.7958 3.2357 4.4944 3.5405 7.1306 1.1855 4.1834 3.7707 4.2026 1.6314 5.1121 3.6460 2.6363 2.1377 3.9435 5.2574 4.6695 4.0490 1.4458 1.6070 2.2310 1.3979 3.2151 3.2663 5.4083 4.3543 3.9154 2.3221 2.9925 1.9861 1.5276 1.4202 1.4379 1.3974 2.4191 1.6512 1.8238 1.2241 1.3149 2.0851 1.8164 1.5735 3.6768 3.6674 1.1116 3.2166 6.3390 7.1221 1.1141 8.3549 1.0613 1.1013 1.0890 1.0895 1.0913 1.0956 1.0458 1.0648 1.0643 1.0972 1.0666
irintensity: 1.9160 0.2354 1.7161 1.5877 1.9982 0.1348 0.6807 0.8982 0.9013 8.7249 7.0583 19.7055 121.1213 22.1527 2.3197 10.3856 29.7865 26.2925 19.0429 4.6937 12.6939 9.5743 118.5007 34.7921 37.0246 73.6824 78.4521 28.2103 66.6174 99.2057 174.5567 14.1740 4.5611 11.9907 21.7102 21.9702 30.4815 11.7751 1.3263 34.9670 34.2934 183.1426 124.9543 19.9698 174.1160 59.5686 17.7406 12.9677 9.7422 206.3941 14.9252 96.2943 11.7055 67.4148 1.5863 21.0829 18.4451 12.7616 8.6211 19.1227 46.9662 16.8048 86.0502 18.4144 16.0471 53.4226 193.6346 22.7798 9.3637 24.9111 11.2449 3.4088 5.5415 7.7433 87.8675 31.5367 9.3449 51.7521
temp: 298.150 k
press: 1.00000 atm
elementType: 9 9 8 8 8 8 7 6 6 6 6 6 6 6 6 6 6 1 1 1 1 1 1 1 1 1 1 1
symmnumber: 1
zpe: 533650.6 jmol-1
zpe.correction: 0.203257 hartree
zpe.thermalcorrener: 0.220151 hartree
zpe.thermalcorrenthalpy: 0.221095 hartree
zpe.thermalcorrgfe: 0.156726 hartree
zpe.sumelectzpe: -941.710197 hartree
zpe.sumelectthermal: -941.693303 hartree
zpe.sumelectthermalent: -941.692358 hartree
zpe.sumelectthermalfe: -941.756727 hartree
dipole: 1.3437 -0.8170 -2.4968
dipole: 2.9508
quadrupole: -103.2852 -83.1388 -102.5868
quadrupole: -14.2620 -4.7781 -6.2592
quadrupole: -6.9483 13.1982 -6.2499 -14.2620 -4.7781 -6.2592
hfenergy: -941.9134535 hartree
pointgroup: C01 [X(C10H11F2N1O4)]
dipole: -0.5160214 0.2060239 -1.0193409 debye
polarizability: 157.6260772|-0.6195284|130.5837158|24.156763|-3.1298947|92.3317674 unknown
InChI: InChI=1S/C10H11F2NO4/c11-8(12)10(13,9(16)17)4-5-1-2-6(14)7(15)3-5/h1-3,8,14-16H,4,13H2
charge 0 multiplicity 1
28 atoms
F  -3.447743 -1.819451 0.568868
F  -1.208618 -2.271196 0.329406
O  -1.995478 2.034485 0.562975
O  -1.579392 0.192742 1.92036
O  3.451857 -1.713286 0.352508
O  4.393326 0.786538 0.725311
N  -3.331878 0.316274 -1.221256
C  -2.099507 -0.108185 -0.528059
C  -0.886959 0.140261 -1.507838
C  0.500661 0.285252 -0.895387
C  -2.312684 -1.618326 -0.295355
C  -1.853068 0.652098 0.798287
C  1.294055 -0.844934 -0.564751
C  1.042753 1.578476 -0.682088
C  2.575454 -0.667145 -0.02094
C  2.337651 1.755882 -0.144702
C  3.11179 0.631111 0.191638
H  -0.912164 -0.668842 -2.262573
H  -1.127879 1.07588 -2.043786
H  -2.529774 -2.136607 -1.246113
H  -3.287846 1.284846 -1.552362
H  -4.18994 0.126871 -0.69045
H  0.898713 -1.856117 -0.713241
H  0.445611 2.459218 -0.942862
H  2.759145 2.752179 0.016721
H  -1.789159 2.527535 1.402135
H  3.009806 -2.594906 0.319703
H  4.770066 -0.113752 0.913451
