program: Gaussian 09
title: 000129674
version: EM64L-G09RevD.01
frameworkgroup: C1[X(C9H13N5O2)]
method: RPBEPBE
basis: SDD
operation: Freq
keyword: #p
keyword: freq=noraman
keyword: PBEPBE/SDD
title: #p freq=noraman PBEPBE/SDD
converged: YES YES NO NO
title: Mulliken charges:
elementType: O O N N N N N C C C C C C C C C H H H H H H H H H H H H H
charge: -0.470496 -0.446504 -0.159677 -0.088599 -0.037628 -0.064388 -0.611953 -0.401703 -0.356131 -0.036860 0.145644 -0.400589 -0.107687 -0.235796 0.168830 -0.371450 0.206665 0.266186 0.197843 0.285650 0.179895 0.246503 0.202874 0.264310 0.363533 0.242212 0.345616 0.342602 0.331096
chargesum: 0.00000
title: Mulliken charges with hydrogens summed into heavy atoms:
elementType: O O N N N N N C C C C C C C C C
charge: -0.106963 -0.100888 -0.159677 -0.088599 -0.037628 -0.064388 0.061746 0.071148 0.127362 0.143035 0.145644 0.048789 -0.107687 0.028515 0.168830 -0.129239
polarizability: 1.89527003e+02 -8.50175643e+00 1.42384070e+02 -1.35609046e+01 -5.80494096e+00 8.40792122e+01
1716.lowfreq: -2.8918 -0.0003 0.0001 0.0006 2.8845 5.3703 24.4156 37.7973 44.1870
frequency: 24.3938 37.7611 44.1838 84.5551 120.6481 134.7494 163.1155 197.2261 208.2619 248.9707 275.6984 296.7443 318.0386 325.1761 394.0480 474.3008 505.5189 509.3376 513.4265 534.8554 544.3585 549.5390 558.2187 591.0859 643.6456 668.6434 698.8049 740.4858 792.0406 794.7933 820.4274 840.7738 855.7369 926.4697 927.9388 955.6400 959.5096 1018.2973 1030.3105 1049.8198 1064.3057 1091.2295 1115.7171 1172.0074 1186.0131 1223.6740 1227.4677 1262.9446 1263.9805 1294.4195 1299.5050 1313.7306 1315.2206 1331.2046 1342.1511 1353.3989 1365.9910 1375.0079 1379.0933 1401.5598 1432.1440 1447.4116 1455.6603 1465.6314 1481.5233 1542.9612 1578.3339 1630.6986 2886.8609 2986.8009 2995.6471 3017.2755 3062.2998 3093.0126 3096.5092 3163.1555 3225.4828 3492.3659 3541.2195 3561.6248 3696.9523
redmass: 4.9290 4.0830 5.5682 3.8131 5.3414 2.4394 5.5416 4.4698 3.7839 4.4705 4.4291 3.5702 1.1249 5.3635 4.0535 2.1176 1.2258 8.7449 3.0264 1.6109 1.0557 2.1925 3.6472 4.5068 4.6544 9.1042 6.2876 3.6140 3.3229 1.6747 2.0102 2.8071 7.2055 2.9119 1.4342 2.0793 2.4775 4.2750 3.4233 1.6486 2.5804 3.2343 1.6388 2.6354 1.6841 1.7569 2.2805 1.4985 1.1221 1.5671 3.8705 2.3305 1.7243 1.3593 1.7911 1.3048 1.5132 1.4485 4.7451 1.7192 2.5336 1.1058 1.7712 1.2884 1.5063 5.8392 1.9520 2.7080 1.0828 1.0643 1.0612 1.0629 1.0987 1.1012 1.1030 1.0919 1.0982 1.0649 1.0441 1.0663 1.1056
irintensity: 1.1571 2.0881 1.5915 7.8058 3.5852 6.1177 0.4042 3.1007 6.6592 0.4832 15.8993 2.8540 98.6959 4.3677 14.2133 7.2173 273.0902 3.3556 33.9640 93.9830 0.3102 90.2597 1.8733 9.4095 44.2272 4.5092 4.8156 15.7774 21.8003 4.7276 3.4673 21.1544 1.2856 86.4617 13.1916 2.8229 14.0325 27.0683 16.9966 9.3043 43.0829 21.4287 46.9206 17.4362 16.4762 42.5795 27.9007 34.0879 11.4682 15.6813 52.5299 18.2857 50.2942 14.6783 31.1490 2.4360 63.0673 7.8686 6.4653 29.3919 65.9427 2.3924 6.6878 8.4287 35.4430 57.2748 34.0759 597.3915 81.7880 24.1287 35.5627 30.7914 5.2466 5.5082 25.9869 17.4632 0.3473 24.0515 119.0482 9.2480 48.3105
temp: 298.150 k
press: 1.00000 atm
elementType: 8 8 7 7 7 7 7 6 6 6 6 6 6 6 6 6 1 1 1 1 1 1 1 1 1 1 1 1 1
symmnumber: 1
zpe: 601779.9 jmol-1
zpe.correction: 0.229206 hartree
zpe.thermalcorrener: 0.244230 hartree
zpe.thermalcorrenthalpy: 0.245174 hartree
zpe.thermalcorrgfe: 0.185490 hartree
zpe.sumelectzpe: -773.760749 hartree
zpe.sumelectthermal: -773.745725 hartree
zpe.sumelectthermalent: -773.744781 hartree
zpe.sumelectthermalfe: -773.804465 hartree
dipole: -2.0470 3.5905 -2.4325
dipole: 4.7957
quadrupole: -76.5160 -96.0280 -95.7935
quadrupole: -9.2182 4.0399 0.3351
quadrupole: 12.9298 -6.5822 -6.3477 -9.2182 4.0399 0.3351
hfenergy: -773.9899551 hartree
pointgroup: C01 [X(C9H13N5O2)]
dipole: 0.8611881 -1.6109827 -0.4722102 debye
polarizability: 188.9940772|-2.4262011|140.289456|18.0098069|-11.4965242|86.7067521 unknown
InChI: InChI=1S/C9H13N5O2/c10-8-7-9(12-4-11-8)14(5-13-7)2-1-6(16)3-15/h4-6,15-16H,1-3,10H2
charge 0 multiplicity 1
29 atoms
O  3.726879 0.615945 1.274377
O  5.814639 0.539534 -0.593161
N  -0.179343 -0.93064 0.629436
N  -2.192842 -1.993023 0.28645
N  -0.848461 1.393811 0.032367
N  -3.222972 1.529259 -0.608265
N  -4.655034 -0.351152 -0.64815
C  2.079222 -0.299671 -0.255727
C  1.243017 -0.734622 0.968512
C  3.573786 -0.238301 0.089009
C  -1.077553 0.058255 0.211882
C  4.42445 0.335552 -1.059228
C  -2.312862 -0.618588 0.008655
C  -0.903689 -2.132722 0.65127
C  -3.413733 0.180622 -0.419471
C  -1.976307 2.048357 -0.375976
H  1.924035 -1.013449 -1.08856
H  1.728893 0.695831 -0.583658
H  1.620441 -1.688265 1.381992
H  1.331841 0.035399 1.752378
H  3.945545 -1.265256 0.328668
H  4.072758 1.346935 -1.321463
H  4.387308 -0.314244 -1.956879
H  -0.44073 -3.07223 0.947664
H  4.675676 0.917495 1.286768
H  -1.87512 3.125327 -0.540935
H  6.285111 -0.332148 -0.567327
H  -4.813269 -1.346536 -0.507859
H  -5.407687 0.264623 -0.948268
