program: Gaussian 09
title: 000129667
version: EM64L-G09RevD.01
frameworkgroup: C1[X(C8H12N2O)]
method: RPBEPBE
basis: SDD
operation: Freq
keyword: #p
keyword: freq=noraman
keyword: PBEPBE/SDD
title: #p freq=noraman PBEPBE/SDD
converged: YES YES NO NO
title: Mulliken charges:
elementType: O N N C C C C C C C C H H H H H H H H H H H H
charge: -0.436943 -0.285390 -0.583928 -0.570647 0.502990 -0.334100 -0.389654 -0.383110 -0.385102 -0.346676 0.278306 0.190170 0.230696 0.191357 0.238634 0.229031 0.237141 0.215453 0.248287 0.240613 0.262835 0.299092 0.350945
chargesum: 0.00000
title: Mulliken charges with hydrogens summed into heavy atoms:
elementType: O N N C C C C C C C C
charge: -0.085998 -0.044778 -0.022000 -0.149781 0.502990 0.095891 -0.160623 -0.145969 -0.169649 -0.098389 0.278306
polarizability: 1.48275142e+02 -2.26232692e+00 9.93518124e+01 1.00395761e+01 -1.87362810e+00 6.54068204e+01
1716.lowfreq: -10.7865 -6.8589 -0.0006 -0.0002 0.0005 14.7317 30.2071 59.6973 82.5196
frequency: 29.0149 59.6122 82.4972 101.4331 165.9214 246.2347 299.3942 326.3766 344.9333 364.0643 402.8262 407.3227 411.1047 468.0870 503.3281 540.2744 636.6589 709.8790 722.6432 761.8569 797.7385 805.5742 826.3280 840.2031 928.3681 961.2822 1003.6543 1009.3026 1035.5906 1063.6617 1111.1042 1143.5864 1152.3847 1173.0562 1178.4123 1216.1526 1234.3386 1244.9344 1262.8650 1286.4053 1318.9614 1354.1483 1391.0588 1425.1888 1469.0394 1476.2821 1493.6229 1504.7511 1598.1083 1627.5996 1647.3756 2882.5483 2973.6278 3039.7637 3062.5469 3107.3173 3126.6448 3134.3352 3169.0765 3332.1938 3414.9058 3583.8376 3597.2704
redmass: 3.4635 5.3752 1.9486 2.8122 4.7470 4.2833 2.6702 3.1197 1.1227 1.5309 2.8765 1.5265 2.8921 2.5951 4.5624 2.6435 6.7488 1.8809 2.6081 3.3824 1.1711 1.4168 2.8732 1.8907 1.3633 1.3556 2.7634 1.9199 2.9758 2.2257 1.3917 1.3731 2.4234 1.3030 1.1141 2.0777 1.6126 2.7981 1.2372 1.4130 1.2624 1.3777 6.1482 2.8219 1.1309 1.0916 1.0875 2.7784 6.4508 6.4900 1.0872 1.0717 1.0633 1.0929 1.0941 1.0874 1.0900 1.0959 1.0953 1.0743 1.0471 1.0660 1.0968
irintensity: 0.0877 0.3086 7.0451 5.6760 0.5585 4.9885 4.8675 14.3773 143.0968 77.6104 9.9851 166.6976 4.5490 23.1204 25.0922 41.5897 0.6761 54.5464 16.6081 23.5200 0.9092 34.6814 12.1764 41.8994 0.3062 0.0688 2.1637 0.4862 21.2479 1.2187 49.4176 204.2310 2.6999 3.7619 4.3877 2.3222 1.8593 28.3447 1.5098 1.6742 10.5741 9.1355 13.8953 11.9677 12.4901 6.5300 7.1180 100.9247 8.9520 24.5893 4.9603 88.4049 40.7396 10.9778 33.5920 20.2328 19.5515 15.5790 6.7344 24.4129 24.4803 35.0815 3.2370
temp: 298.150 k
press: 1.00000 atm
elementType: 8 7 7 6 6 6 6 6 6 6 6 1 1 1 1 1 1 1 1 1 1 1 1
symmnumber: 1
zpe: 499970.9 jmol-1
zpe.correction: 0.190429 hartree
zpe.thermalcorrener: 0.201857 hartree
zpe.thermalcorrenthalpy: 0.202802 hartree
zpe.thermalcorrgfe: 0.152211 hartree
zpe.sumelectzpe: -495.888123 hartree
zpe.sumelectthermal: -495.876695 hartree
zpe.sumelectthermalent: -495.875751 hartree
zpe.sumelectthermalfe: -495.926342 hartree
dipole: 1.2457 3.0719 -0.0350
dipole: 3.3150
quadrupole: -54.7265 -58.9899 -70.0448
quadrupole: -2.1289 1.4342 -2.3827
quadrupole: 6.5272 2.2638 -8.7910 -2.1289 1.4342 -2.3827
hfenergy: -496.0785521 hartree
pointgroup: C01 [X(C8H12N2O1)]
dipole: -0.4738941 1.2112947 -0.0958375 debye
dipolederiv: -1.4787324 0.0097795 -0.2623406 0.0259698 -0.0623852 -0.0094152 -0.3121538 -0.0127813 -0.5063768 -0.1954795 -0.0447176 -0.2221005 -0.2592856 -0.2069791 -0.2430591 -0.0534722 -0.3299296 -0.1287223 -0.4411813 0.1030888 -0.2073401 0.247689 -0.1692652 0.2112346 -0.184383 0.347378 -0.3841688 -0.1548725 0.0037569 0.0421687 -0.023346 0.1622936 -0.0407928 0.1812902 -0.0223025 0.116408 0.3019669 -0.0156592 0.0390903 0.0183861 -0.1952177 0.0149329 0.0848719 0.0064343 -0.0937906 0.5069198 0.0648793 0.1186756 -0.0268501 0.2864453 0.1230472 -0.0562724 0.0919931 0.1707947 0.0118505 0.1039756 0.0587832 -0.0760166 0.1254249 -0.0332556 0.0426398 0.0193043 -0.1276279 0.0250968 -0.0599032 0.0731194 0.0672105 0.1414118 0.0061101 0.0557948 -0.0380387 -0.1281137 -0.3071092 -0.0368438 -0.0140525 0.2880345 0.0105836 0.060787 -0.0444226 -0.0213537 -0.2071533 -0.280113 0.0355324 -0.0228236 -0.2548529 0.0439696 -0.0736397 -0.0207425 0.0016661 -0.1697651 1.3473409 0.0225378 0.3472647 0.0144002 0.0386091 0.0086386 0.3830198 0.0070961 0.1686542 0.0097809 0.0210594 -0.0399997 0.0750688 -0.0902157 0.1477 -0.0414943 0.0792798 -0.0178539 0.0338703 -0.0177651 -0.0385772 -0.0402143 -0.0546461 -0.1206029 -0.036325 -0.0718802 -0.0048383 -0.0961638 -0.0541589 -0.0379431 -0.0987489 -0.1275149 -0.1653126 -0.0909964 -0.1074728 -0.0695217 0.0369026 0.0263247 -0.0257628 0.0440765 -0.0588112 0.0912597 -0.0679197 0.0693989 -0.0012259 0.0431701 0.0970275 -0.0448603 0.0926971 -0.0607877 0.0332541 -0.0379043 0.0381653 0.1249842 0.0404771 -0.1045429 -0.0354744 -0.0949865 -0.0437313 -0.0149717 -0.0317829 -0.0202824 0.1297558 -0.0246454 -0.1121471 -0.0467563 -0.1081063 -0.0486813 -0.0167293 -0.0565195 -0.0206405 0.1590415 0.0504794 0.0724665 -0.0351472 0.0764868 -0.0239204 0.0277774 -0.0415031 0.0282859 0.1590501 0.0634491 -0.006214 0.0949091 0.0575763 0.0397437 0.2642784 0.0688739 0.1548106 0.0539814 0.0819033 0.0002447 0.1756425 0.0541664 0.0219284 -0.1729842 0.2201226 -0.1031646 0.1618889 0.023458 -0.1111884 0.0850985 -0.0364621 0.2280042 -0.0985943 0.0324193 -0.1113566 0.2120565 0.4016316 0.002467 -0.0015738 -0.0428926 0.0437416 0.0003374 0.0068594 0.0153903 0.3825428 unknown
polarizability: 148.3678785|2.5055079|99.3339642|9.7052406|-1.3660546|65.3319321 unknown
InChI: InChI=1S/C8H12N2O/c9-10-6-5-7-1-3-8(11)4-2-7/h1-4,10-11H,5-6,9H2
charge 0 multiplicity 1
23 atoms
O  4.095515 -0.116036 0.669932
N  -3.791088 0.097912 -0.14226
N  -4.718155 0.018466 0.933096
C  -1.44521 0.074351 -0.947274
C  0.023991 0.048311 -0.556843
C  -2.375832 0.099019 0.292787
C  0.762487 1.246151 -0.391644
C  0.68756 -1.181731 -0.301931
C  2.115727 1.227045 0.014769
C  2.035983 -1.222382 0.104729
C  2.750032 -0.012861 0.264315
H  -1.655168 0.965968 -1.573313
H  -1.711639 -0.813084 -1.55064
H  -2.115061 0.978939 0.930725
H  -2.218015 -0.802875 0.908702
H  0.277594 2.210251 -0.588508
H  0.139347 -2.123374 -0.427465
H  2.669373 2.168307 0.131315
H  2.548565 -2.169514 0.297543
H  -3.985731 0.865491 -0.808075
H  -4.961598 0.882975 1.43165
H  -5.49061 -0.624594 0.760559
H  4.505235 0.780468 0.753131
