program: Gaussian 09
title: 000129685
version: EM64L-G09RevD.01
frameworkgroup: C1[X(C11H20N2O2)]
method: RPBEPBE
basis: SDD
operation: Freq
keyword: #p
keyword: freq=noraman
keyword: PBEPBE/SDD
title: #p freq=noraman PBEPBE/SDD
converged: YES YES NO NO
title: Mulliken charges:
elementType: O O N N C C C C C C C C C C C H H H H H H H H H H H H H H H H H H H H
charge: -0.408702 -0.279545 -0.315676 0.059070 0.043200 -0.449196 -0.446638 -0.403116 -0.401674 -0.383346 -0.425486 -0.382230 0.013582 -0.794080 0.136528 0.184811 0.194902 0.207477 0.195384 0.195916 0.200465 0.189490 0.191598 0.198691 0.200424 0.190119 0.227403 0.184848 0.208715 0.254402 0.293419 0.293843 0.222404 0.228736 0.374263
chargesum: 0.00000
title: Mulliken charges with hydrogens summed into heavy atoms:
elementType: O O N N C C C C C C C C C C C
charge: -0.034439 -0.279545 -0.022257 0.059070 0.228011 -0.046816 -0.055339 -0.013160 -0.011384 0.007197 -0.013236 0.080887 0.013582 -0.049097 0.136528
polarizability: 2.11539796e+02 7.68583307e+00 1.32453532e+02 -1.60433872e+01 -2.15858865e+00 1.07015528e+02
1716.lowfreq: -3.9220 -0.0008 -0.0006 0.0003 5.1061 12.8595 19.0165 33.7283 39.6241
frequency: 17.9007 30.9911 39.5920 71.4418 83.5966 119.8238 149.5810 168.3294 178.5614 195.0385 222.1187 261.2821 295.5819 319.0576 353.9231 383.9182 404.9876 412.9171 433.6858 439.8221 481.1759 515.6978 556.7360 566.9611 605.8736 626.6274 715.1865 748.3329 777.6169 785.3628 794.0795 841.7909 864.7311 889.1718 911.3905 945.7018 960.2503 992.9812 1019.1638 1036.3585 1036.6009 1048.4697 1053.5260 1057.5779 1088.9600 1096.8339 1114.8072 1153.9265 1184.6814 1191.2866 1220.1892 1230.2509 1249.8081 1257.2809 1267.1028 1273.2236 1300.5800 1315.6211 1316.7228 1334.8953 1339.1128 1341.1304 1342.9358 1360.7562 1363.7204 1366.0215 1387.4066 1447.5160 1450.4811 1460.8286 1462.4362 1465.3617 1468.0409 1472.9670 1479.7082 1484.5711 1497.8102 1545.7139 1610.2641 2924.9965 2951.3456 2954.0122 2957.8331 2961.5010 2964.7724 2965.3128 2966.4255 2986.9791 3014.1087 3019.3160 3020.9841 3027.2046 3027.9566 3029.3059 3041.1942 3094.7336 3113.8980 3402.1968 3520.9409
redmass: 4.9249 3.2712 5.7158 2.8109 4.9285 3.4068 2.9448 1.2148 2.6618 3.5269 1.7819 3.4261 3.3947 1.9990 2.5873 2.8263 3.1042 2.2280 2.9334 2.0989 2.3525 4.9661 1.3151 1.8064 2.0056 3.4702 6.4548 1.6034 2.2759 1.6090 2.0235 1.9852 1.8481 1.5900 1.8379 2.1188 2.2641 1.8885 2.7504 2.4513 1.4941 2.1827 1.9271 1.1678 1.4432 2.5608 2.5394 2.3282 1.8308 1.7877 1.7554 2.1334 1.2322 1.2786 1.3161 1.1943 1.2092 1.2554 1.2672 1.4000 1.5144 1.4698 1.5119 1.3978 1.5986 2.2437 1.4724 1.1860 1.0701 1.0908 1.0891 1.0890 1.0956 1.0838 1.0957 1.0457 1.4262 5.6611 7.3628 1.0813 1.0402 1.0605 1.0616 1.0617 1.0625 1.0642 1.0636 1.0682 1.0983 1.0974 1.0975 1.0967 1.0966 1.1013 1.1035 1.0967 1.0942 1.0744 1.0639
irintensity: 0.8883 0.1836 0.1132 0.1887 2.1072 1.6226 1.5017 5.0347 0.4558 3.7043 0.0835 1.3970 3.6342 0.4644 0.7187 5.9809 14.3412 12.9065 0.3469 4.0924 13.8757 24.6789 146.8207 56.4117 10.4758 18.0878 45.4189 4.7609 8.4541 1.2083 9.7262 7.0394 0.6174 11.6667 1.4161 13.7012 8.9791 26.1108 1.8264 307.3191 4.0775 2.1429 2.1870 0.5414 3.0087 2.3484 0.0673 1.1933 92.5294 70.1506 22.8575 97.0437 0.1020 2.0718 4.6772 5.7434 1.8973 0.2195 0.3844 0.8195 0.5528 1.6453 1.2279 11.4575 19.5791 72.8952 23.0937 5.1950 7.2477 4.3746 3.9563 11.5117 5.3806 24.4196 2.7070 18.8742 3.5129 356.4449 332.9540 16.6959 21.2315 7.5180 47.3802 77.4388 24.8379 21.6216 32.8814 44.7986 51.1000 25.5073 60.0953 81.5755 23.2523 12.5477 146.1477 12.6959 0.7756 7.1105 34.8118
temp: 298.150 k
press: 1.00000 atm
elementType: 8 8 7 7 6 6 6 6 6 6 6 6 6 6 6 1 1 1 1 1 1 1 1 1 1 1 1 1 1 1 1 1 1 1 1
symmnumber: 1
zpe: 791338.6 jmol-1
zpe.correction: 0.301405 hartree
zpe.thermalcorrener: 0.317701 hartree
zpe.thermalcorrenthalpy: 0.318646 hartree
zpe.thermalcorrgfe: 0.255628 hartree
zpe.sumelectzpe: -689.904336 hartree
zpe.sumelectthermal: -689.888040 hartree
zpe.sumelectthermalent: -689.887096 hartree
zpe.sumelectthermalfe: -689.950113 hartree
dipole: -4.1075 -2.3026 0.9482
dipole: 4.8034
quadrupole: -112.4790 -83.8940 -91.8271
quadrupole: -1.9641 2.8498 -3.1388
quadrupole: -16.4123 12.1727 4.2397 -1.9641 2.8498 -3.1388
hfenergy: -690.2057413 hartree
pointgroup: C01 [X(C11H20N2O2)]
dipole: 1.5881105 -0.6634356 -0.7804917 debye
polarizability: 208.0602131|2.2300229|128.3025534|-25.7948181|8.7342896|114.6460898 unknown
InChI: InChI=1S/C11H20N2O2/c1-9(11(14)15)13-12-8-7-10-5-3-2-4-6-10/h10,12,14H,2-8H2,1H3
charge 0 multiplicity 1
35 atoms
O  -3.777323 1.622351 1.510422
O  -5.412524 -0.025817 1.497966
N  -1.291411 -0.635482 -0.736468
N  -2.149958 0.079104 0.023061
C  2.567545 -0.299688 -0.295099
C  2.817009 1.22541 -0.144417
C  3.551972 -1.092773 0.60577
C  4.293217 1.600716 -0.419405
C  5.027371 -0.723257 0.328688
C  5.261292 0.798285 0.481631
C  1.106202 -0.704562 0.021819
C  0.062614 -0.106933 -0.953163
C  -3.336987 -0.448966 0.327061
C  -3.804193 -1.821808 -0.110811
C  -4.262286 0.358932 1.140005
H  2.782785 -0.576177 -1.353237
H  2.546317 1.529678 0.889179
H  2.15775 1.796924 -0.82662
H  3.397733 -2.181049 0.460158
H  3.314323 -0.876729 1.669246
H  4.439901 2.687842 -0.26806
H  4.530513 1.391552 -1.483617
H  5.294317 -1.030773 -0.704065
H  5.694172 -1.284891 1.011583
H  6.311239 1.052459 0.238325
H  5.097415 1.087271 1.540785
H  0.843832 -0.397321 1.053888
H  1.02973 -1.812203 -0.010775
H  0.361842 -0.319248 -1.999046
H  -0.011016 0.985691 -0.832687
H  -1.499907 -1.60444 -1.017125
H  -4.813954 -2.006544 0.285141
H  -3.135877 -2.624198 0.265464
H  -3.845841 -1.90623 -1.216161
H  -4.489216 2.061274 2.049965
