program: Gaussian 09
title: 000129662
version: EM64L-G09RevD.01
frameworkgroup: C1[X(C5H9NO2)]
method: RPBEPBE
basis: SDD
operation: Freq
keyword: #pfreq=noraman
keyword: PBEPBE/SDD
title: #p freq=noraman PBEPBE/SDD
converged: NO NO NO NO
title: Mulliken charges:
elementType: O O N C C C C C H H H H H H H H H
charge: -0.431632 -0.256115 -0.558847 -0.418639 -0.385872 -0.111132 -0.296850 0.164414 0.217307 0.217082 0.216695 0.216651 0.249717 0.267425 0.266290 0.266345 0.377161
chargesum: 0.00000
title: Mulliken charges with hydrogens summed into heavy atoms:
elementType: O O N C C C C C
charge: -0.054471 -0.256115 -0.026212 0.015749 0.047474 0.138586 -0.029425 0.164414
polarizability: 1.01190867e+02 -8.89937114e+00 6.70034549e+01 -4.34109649e-02 -2.86172701e-02 4.30598908e+01
1716.lowfreq: -11.3205 -8.7628 -3.5048 0.0008 0.0009 0.0011 58.5920 89.6868 104.6287
frequency: 58.3312 89.6860 104.6254 155.0793 216.8866 223.6521 265.0545 314.7557 451.3819 527.7021 555.9067 578.2695 630.7259 668.1059 739.7490 849.5231 900.7764 950.3424 954.4379 998.9216 1045.4893 1092.9577 1105.2471 1112.6479 1226.7428 1262.9336 1282.6929 1306.4024 1331.7732 1334.5282 1362.5204 1435.7967 1472.0591 1638.6064 1643.3258 1661.9854 2944.5040 2979.4332 2993.0895 3053.7706 3094.3219 3175.3807 3467.2873 3520.1712 3595.4826
redmass: 4.2288 1.8858 5.1620 2.6484 6.0484 2.1295 1.0824 3.0680 3.9884 4.0125 1.6360 1.2951 4.5905 1.7368 1.5222 1.7675 3.3644 5.1405 1.3183 1.0706 2.2877 2.3930 3.3864 1.3232 1.3857 1.2377 1.6020 1.2563 1.1731 2.1147 1.4222 1.0817 1.0865 7.5608 1.1101 5.6370 1.0602 1.0967 1.0603 1.1049 1.0903 1.0928 1.0445 1.0640 1.0983
irintensity: 5.0029 4.7785 1.6169 0.2356 0.9406 4.5019 52.4802 14.5323 24.7109 19.6757 325.3285 70.1305 10.9221 109.9189 0.1439 7.8026 16.5462 102.1764 2.8121 44.9860 225.3557 25.2874 74.0568 0.1535 2.9020 0.2440 21.9375 3.1874 0.0044 45.5066 11.8356 34.0850 9.3452 260.6687 45.4375 99.2886 16.2054 12.2849 35.8168 40.8181 7.7145 5.9431 0.7690 37.4612 0.8862
temp: 298.150 k
press: 1.00000 atm
elementType: 8 8 7 6 6 6 6 6 1 1 1 1 1 1 1 1 1
symmnumber: 1
zpe: 361111.1 jmol-1
zpe.correction: 0.137540 hartree
zpe.thermalcorrener: 0.146873 hartree
zpe.thermalcorrenthalpy: 0.147817 hartree
zpe.thermalcorrgfe: 0.102762 hartree
zpe.sumelectzpe: -400.475473 hartree
zpe.sumelectthermal: -400.466140 hartree
zpe.sumelectthermalent: -400.465196 hartree
zpe.sumelectthermalfe: -400.510252 hartree
dipole: -2.0217 0.6202 0.0092
dipole: 2.1147
quadrupole: -45.0577 -52.7991 -46.9210
quadrupole: -12.8832 -0.0202 -0.0054
quadrupole: 3.2015 -4.5398 1.3383 -12.8832 -0.0202 -0.0054
hfenergy: -400.6130133 hartree
pointgroup: C01 [X(C5H9N1O2)]
dipole: -0.7876423 0.267903 0.0082293 debye
dipolederiv: -0.6247962 0.5400751 0.0068273 0.5245783 -1.0637866 -0.0087153 0.0068057 -0.0090506 -0.4407297 -0.9350403 -0.2169327 -0.0011366 -0.2287266 -0.8167806 -0.0051769 -0.0010688 -0.0049035 -0.3382968 -0.8368189 -0.2448157 -0.003869 -0.3929193 -0.664685 -0.0078574 -0.0064094 -0.0081454 -0.1808527 -0.3361006 0.0096117 0.0013662 0.0676534 -0.0758034 -0.0037635 0.0041893 -0.0044938 0.1520166 0.6540678 0.1060465 0.0016332 0.1489214 0.3087078 0.0014368 0.0013707 0.0018392 0.2103662 0.5431378 -0.1459929 -0.0041489 -0.3745716 0.1921745 0.0045833 -0.0083269 0.0044899 -0.1314865 -0.8250771 0.2445896 0.0046462 0.4132946 -0.101603 0.0000447 0.0065224 0.0003692 -0.1923104 1.814903 -0.3530194 -0.0082596 -0.1574187 1.4356627 0.0143806 -0.0058017 0.0148524 0.259786 -0.0201244 0.0547777 0.0574047 -0.0557329 0.0300252 -0.0922599 0.0819953 -0.121664 -0.0454 -0.0205833 0.0568365 -0.0559308 -0.0539975 0.0224234 0.0947624 -0.084815 0.1238508 -0.0377356 0.0030912 0.034813 0.0636508 0.005129 -0.0038301 -0.0895942 0.0829664 -0.0973445 -0.0705973 0.0034901 0.0365123 -0.0623635 0.0076056 -0.0097307 0.0915264 -0.0826033 0.0994145 -0.0649322 -0.0064798 -0.0928625 -0.0010426 -0.0757145 -0.0201194 -0.0018865 0.0003401 -0.0014373 0.1446576 0.0566306 -0.0520392 -0.0002996 -0.0923285 -0.0110263 -0.0019819 -0.0010486 -0.0021084 0.1717307 0.1847282 0.0583826 0.0150416 0.2049768 0.2384198 0.1585741 -0.0050618 0.0916477 0.0872787 0.1845875 0.0590237 -0.0130481 0.2048725 0.2464054 -0.1532105 0.0119995 -0.086333 0.0793667 0.1603844 -0.0950062 -0.0004712 -0.145622 0.2935463 -0.000862 -0.001054 -0.0009833 0.3971387 unknown
polarizability: 100.6198877|-9.9165587|67.5701127|-0.2492895|0.3184601|43.0642119 unknown
InChI: InChI=1S/C5H9NO2/c6-4-2-1-3-5(7)8/h1,3,7H,2,4,6H2
charge 0 multiplicity 1
17 atoms
O  2.707239 -1.398689 -0.020274
O  2.782548 0.927648 0.007108
N  -3.859124 -0.41114 -0.002775
C  -1.666371 0.894088 0.018808
C  -2.387713 -0.480645 -0.002794
C  -0.159041 0.863301 0.014477
C  0.62731 -0.251054 -0.000981
C  2.098335 -0.127243 -0.003175
H  -2.001905 1.469311 0.90982
H  -2.007056 1.499543 -0.849786
H  -2.070442 -1.04869 -0.897706
H  -2.072068 -1.076075 0.874709
H  0.35956 1.834858 0.024846
H  0.225923 -1.267668 -0.012319
H  -4.269425 -0.001449 -0.846664
H  -4.270832 -0.029132 0.853319
H  3.695165 -1.275665 -0.021614
