program: Gaussian 09
title: 000129665
version: EM64L-G09RevD.01
frameworkgroup: C1[X(C6H10FNO4)]
method: RPBEPBE
basis: SDD
operation: Freq
keyword: #p
keyword: freq=noraman
keyword: PBEPBE/SDD
title: #p freq=noraman PBEPBE/SDD
converged: YES YES NO NO
title: Mulliken charges:
elementType: F O O O O N C C C C C C H H H H H H H H H H
charge: -0.227667 -0.392781 -0.244228 -0.416427 -0.241436 -0.652374 0.161241 -0.399903 -0.486812 -0.255510 0.156992 0.172964 0.228870 0.260157 0.272936 0.278199 0.203733 0.220903 0.316706 0.280754 0.387480 0.376204
chargesum: 0.00000
title: Mulliken charges with hydrogens summed into heavy atoms:
elementType: F O O O O N C C C C C C
charge: -0.227667 -0.005301 -0.244228 -0.040223 -0.241436 -0.054913 0.161241 0.089124 0.064322 0.169126 0.156992 0.172964
polarizability: 9.51351134e+01 3.02393793e+00 8.31320369e+01 -5.02095292e+00 2.54342456e+00 7.38819027e+01
1716.lowfreq: -12.9124 -0.0001 0.0005 0.0006 1.4381 11.0316 34.8432 50.5881 53.5676
frequency: 34.7138 50.5829 53.4532 72.6495 108.5558 138.6284 179.9704 199.6350 253.0072 279.0069 305.3106 353.3908 383.3827 405.2607 484.5525 501.7592 518.0441 531.8047 552.4733 604.5937 626.2863 654.0908 712.8645 740.5492 786.7913 864.8287 912.6016 922.4990 993.8508 1019.8924 1042.0135 1064.0642 1074.6365 1097.8440 1146.4641 1169.9480 1220.4026 1242.0946 1263.5749 1280.6746 1327.8995 1340.4962 1368.8594 1380.4772 1447.5132 1450.1721 1468.3603 1596.8381 1654.4901 1661.6404 2974.6561 3001.3607 3005.6415 3071.5303 3088.1369 3091.9153 3483.5852 3506.0131 3510.1014 3626.0971
redmass: 10.6950 11.3040 4.5910 8.2447 5.0719 2.7910 5.3438 5.1314 2.8426 3.9485 1.4233 3.4143 2.3435 4.3248 2.5959 3.2109 1.6343 2.1422 2.8715 3.4304 1.3121 1.4566 3.8330 5.9961 1.4611 4.0505 2.3148 7.4581 1.9686 2.3231 2.6213 2.6320 2.3311 2.6494 1.5345 1.1584 1.7221 1.4451 1.8588 1.5938 1.4834 1.3532 2.1258 1.7201 1.0947 1.0872 1.0935 1.3784 3.4010 7.9625 1.0666 1.0653 1.0555 1.0909 1.1123 1.0977 1.0445 1.0640 1.0638 1.1006
irintensity: 1.5462 1.8436 1.1646 1.7481 3.4688 1.7095 8.0244 3.4243 0.3497 0.9184 43.9030 4.6910 9.0236 31.2962 5.1582 38.1385 206.8053 50.1569 28.2404 21.4666 166.3225 129.7240 13.6605 8.1801 21.1416 1.6843 11.8259 64.7778 21.7375 21.6927 177.7503 121.6473 181.3352 22.0534 10.4357 0.6905 7.8739 18.0498 16.0339 34.0229 41.4808 17.3153 15.8152 37.7845 10.2161 18.3981 28.0509 173.9675 139.3296 195.9559 26.7622 7.8793 37.9819 1.7490 23.6016 9.2775 14.8943 31.4754 21.4272 15.6237
temp: 298.150 k
press: 1.00000 atm
elementType: 9 8 8 8 8 7 6 6 6 6 6 6 1 1 1 1 1 1 1 1 1 1
symmnumber: 1
zpe: 436054.0 jmol-1
zpe.correction: 0.166084 hartree
zpe.thermalcorrener: 0.179386 hartree
zpe.thermalcorrenthalpy: 0.180331 hartree
zpe.thermalcorrgfe: 0.124954 hartree
zpe.sumelectzpe: -689.185354 hartree
zpe.sumelectthermal: -689.172052 hartree
zpe.sumelectthermalent: -689.171108 hartree
zpe.sumelectthermalfe: -689.226485 hartree
dipole: -0.2359 -0.6189 1.2863
dipole: 1.4468
quadrupole: -69.4950 -72.8591 -67.0330
quadrupole: -5.2490 -2.8579 10.1407
quadrupole: 0.3007 -3.0634 2.7627 -5.2490 -2.8579 10.1407
hfenergy: -689.3514384 hartree
pointgroup: C01 [X(C6H10F1N1O4)]
dipole: -0.1055983 0.3927258 -0.3982848 debye
dipolederiv: -0.3488883 -0.1121487 0.0785158 -0.151744 -0.5050594 0.234473 0.1691041 0.3227108 -0.6118336 -0.4268071 -0.0187536 -0.1851238 -0.0804335 -0.2709999 0.0028228 -0.2834452 0.0557252 -1.0886843 -0.641209 0.3009482 -0.2067045 0.3728342 -0.6625392 0.1288347 -0.0254792 -0.0673877 -0.6183573 -0.8757335 -0.4991899 -0.2719412 -0.4598164 -0.6680486 -0.1524489 -0.264983 -0.1542771 -0.5162896 -0.7351325 0.2043953 0.0583155 0.000561 -0.858071 -0.227944 -0.0293668 -0.225409 -0.411492 -0.702941 -0.2265189 0.0143132 -0.2598883 -0.5404034 0.1478435 -0.0759801 0.165959 -0.5322376 0.3036178 0.0208195 0.0533868 0.0811808 0.0223064 -0.1779226 -0.003184 -0.1991993 0.3155768 0.0113293 0.0021322 -0.0698996 0.0251715 0.0039448 0.0410337 0.0240091 -0.0043188 0.0398895 -0.4147774 0.0709585 -0.0462796 0.2999621 -0.0803621 0.0082042 -0.1218824 -0.0127302 0.0861528 0.3195624 0.1454339 -0.0182243 0.1334355 0.5641029 -0.1680683 -0.1475148 -0.3193775 0.5836641 0.6872551 -0.4982381 0.3343754 -0.5074366 0.7513752 0.0113254 0.2753047 0.1616976 1.2905005 1.5325028 0.0951426 0.1949116 0.1349689 1.210991 0.4484251 0.242363 0.4520518 0.4184211 0.0858463 0.0377931 0.0185219 -0.0068163 -0.0121559 -0.0985884 0.0201283 -0.1070079 -0.0103966 0.0786552 -0.0224191 0.0057042 -0.0418396 0.059376 0.0579548 -0.007275 0.0768818 -0.0226123 0.0974631 -0.0044169 0.0072024 -0.0362068 0.0450785 -0.0725362 0.0026532 -0.0904627 0.0007926 0.1660737 0.0217908 0.0270539 -0.0424263 0.0576464 0.0453989 0.118621 0.0752021 0.0513814 0.0665098 0.0423557 0.0698449 0.0328517 -0.0622112 -0.0866547 0.0504108 -0.0505464 -0.0590008 -0.1204114 0.0168784 -0.0592292 0.0519602 0.0450386 0.0581373 -0.0209038 0.0384179 0.0245325 0.1497434 0.1021583 -0.0569662 0.0488962 0.2992689 0.0110436 -0.0063781 0.0200622 0.214682 0.3347497 0.087024 -0.0271289 0.1148634 0.1281416 -0.0898006 0.0336755 -0.0485994 0.1468551 0.2531095 0.1369013 0.0476822 0.1414479 0.2262598 -0.0681389 0.002264 -0.0286913 0.335148 0.1794819 0.0969534 0.0316694 0.1484743 0.2463207 -0.0533945 0.0478586 -0.0607011 0.3633078 unknown
polarizability: 95.377139|-4.235743|80.5408918|3.2954549|4.9699868|76.2310222 unknown
InChI: InChI=1S/C6H10FNO4/c7-3-6(8,5(11)12)2-1-4(9)10/h9,11H,1-3,8H2
charge 0 multiplicity 1
22 atoms
F  -2.204342 -2.001225 0.70381
O  -1.215757 0.798517 1.68615
O  -2.516841 1.746411 0.019857
O  3.716318 0.82712 0.39088
O  3.158294 -1.197791 -0.592917
N  -1.001968 0.455166 -1.89496
C  -1.066382 -0.161855 -0.56153
C  0.325336 -0.677237 -0.123022
C  1.380319 0.440471 -0.047708
C  -2.084306 -1.347501 -0.60184
C  -1.665961 0.899834 0.37712
C  2.791837 -0.096816 -0.121993
H  0.658375 -1.433024 -0.861485
H  0.228967 -1.192363 0.847089
H  1.274597 1.047246 0.866952
H  1.238539 1.126481 -0.909435
H  -1.722029 -2.114043 -1.312529
H  -3.091835 -0.98912 -0.880679
H  -1.767699 1.095843 -2.119968
H  -0.697142 -0.157072 -2.653806
H  -1.703225 1.453397 2.257111
H  4.635005 0.455363 0.290404
