program: Gaussian 09
title: 000129753
version: EM64L-G09RevD.01
frameworkgroup: C1[X(C15H28N4O7)]
method: RPBEPBE
basis: SDD
operation: Freq
keyword: #p
keyword: freq=noraman
keyword: PBEPBE/SDD
title: #p freq=noraman PBEPBE/SDD
converged: YES YES NO NO
title: Mulliken charges:
elementType: O O O O O O O N N N N C C C C C C C C C C C C C C C H H H H H H H H H H H H H H H H H H H H H H H H H H H H
charge: -0.261625 -0.501609 -0.345659 -0.411494 -0.219304 -0.413854 -0.246872 -0.369518 -0.384704 -0.649136 -0.571184 -0.215697 -0.473390 -0.354930 -0.355944 0.201181 -0.165933 -0.207207 0.207894 -0.386476 -0.037455 -0.396050 -0.508261 0.137818 -0.693379 0.195348 0.270999 0.229934 0.227539 0.193289 0.198242 0.222205 0.183562 0.367618 0.306121 0.258764 0.367861 0.254908 0.245991 0.211496 0.177568 0.207453 0.260803 0.289844 0.224737 0.202358 0.278023 0.272313 0.323075 0.273071 0.259032 0.360407 0.383799 0.376429
chargesum: 0.00000
title: Mulliken charges with hydrogens summed into heavy atoms:
elementType: O O O O O O O N N N N C C C C C C C C C C C C C C C
charge: -0.261625 -0.141201 -0.345659 -0.027695 -0.219304 -0.037425 -0.246872 -0.001901 -0.016843 -0.053747 -0.039082 0.055302 -0.015917 0.036601 0.049823 0.201181 0.140188 0.051556 0.207894 0.114423 0.174041 -0.011030 0.042385 0.137818 0.011740 0.195348
polarizability: 2.45169496e+02 -2.20427384e+00 2.06666207e+02 1.30398946e+01 -1.30696208e+00 1.85128400e+02
1716.lowfreq: -5.9624 -0.0008 -0.0006 0.0004 5.8213 7.5556 17.0699 22.6949 28.7405
frequency: 16.3113 22.5842 28.5874 35.9417 38.4826 40.3271 42.5416 49.0764 52.9641 61.3306 73.3988 82.1266 96.1211 108.7233 119.0362 124.2458 129.4674 142.1242 153.4477 180.0112 185.7149 204.0392 225.7954 233.1942 237.5699 248.6910 265.4694 271.4747 278.8901 296.1065 321.1861 340.3794 346.3447 360.0036 386.1742 421.5660 426.2915 427.7240 460.5429 484.0913 489.9146 522.7380 536.7116 550.1978 565.5515 590.5374 595.7192 599.5929 626.1366 650.9200 669.6652 688.2312 716.3757 721.2000 733.9948 751.4368 763.6515 777.8924 785.7849 802.7285 832.7004 841.8439 870.5914 881.7913 893.5249 922.2919 928.1674 937.8022 966.4533 994.6671 1020.3358 1031.5005 1032.6471 1035.1250 1049.5984 1062.0301 1072.6123 1076.8127 1088.1403 1093.3733 1103.0680 1118.0874 1125.9888 1131.2819 1166.8614 1190.5641 1200.4607 1208.6288 1212.8530 1218.2694 1238.5054 1245.6221 1252.0763 1259.2014 1267.1544 1275.5464 1279.9419 1282.1575 1288.9305 1299.3051 1305.1563 1319.5885 1321.2879 1336.0551 1339.3093 1343.9451 1347.8108 1361.5214 1380.3655 1386.9065 1388.5738 1390.8396 1445.9767 1460.9885 1464.6254 1465.2426 1468.2045 1480.2528 1480.7933 1493.4979 1524.4351 1532.4798 1563.3507 1622.9684 1636.6869 1638.5853 1660.3211 1666.8575 2859.2479 2907.4854 2956.8301 2964.3338 2972.4567 2984.5358 2988.8416 2993.9620 3003.0569 3004.1513 3008.6411 3021.1785 3031.3778 3042.3280 3053.9168 3060.7528 3073.4388 3090.1560 3106.0185 3309.6734 3401.2845 3444.6375 3453.2779 3509.7118 3515.7361 3581.0922 3587.9316 3599.7715
redmass: 6.2469 6.0142 6.3697 4.1383 6.2832 5.6387 2.1985 6.1050 5.9014 7.1650 5.2714 4.1351 4.3577 2.9877 3.7362 2.8073 2.9346 3.3825 3.6565 4.9868 3.8220 3.6421 3.2710 1.2793 1.5524 2.8342 3.7112 1.3193 4.1016 2.6023 2.2021 3.5603 2.7280 3.5755 2.0356 4.0593 3.8555 4.3411 3.6443 3.6050 3.3382 2.0620 3.8245 3.1497 2.7983 3.0790 2.4502 1.5263 1.6527 1.4863 3.5143 1.6550 1.2274 4.6073 1.1922 3.4942 3.1238 1.3716 1.6117 2.7875 1.4398 2.1523 2.8588 2.8258 2.3108 2.9445 3.2739 2.1456 2.6316 2.1104 2.5364 2.4386 1.7333 2.4097 2.2608 2.5803 2.3024 1.8428 2.6307 2.2168 2.6537 2.2344 2.3672 1.6646 2.1876 1.8826 1.2764 1.2410 1.4699 1.4563 1.3910 1.6970 1.4286 1.8107 1.6370 1.2924 1.2865 1.1050 1.2251 1.2145 1.3409 1.6002 1.2613 1.4288 1.4825 1.5000 1.8831 1.6543 1.2743 1.6995 1.4641 1.5767 1.0881 1.0869 1.0785 1.0742 1.0637 1.0631 1.0907 1.0905 1.7385 2.1560 2.5407 3.0004 1.6143 1.0953 7.9462 8.7523 1.0715 1.0812 1.0626 1.0616 1.0665 1.0445 1.0792 1.0700 1.0769 1.0904 1.0908 1.0659 1.0769 1.1008 1.0937 1.1019 1.0988 1.1030 1.0978 1.0815 1.0805 1.0490 1.0448 1.0638 1.0642 1.0975 1.0663 1.0945
irintensity: 0.0961 0.4479 1.1436 2.3219 1.3174 0.5746 1.4545 2.7431 7.0903 1.8515 2.0038 0.9968 4.2008 2.7269 1.0115 3.0329 5.1941 0.9629 4.9806 4.5338 1.6067 3.1158 4.2198 6.0070 51.7855 9.1262 17.7818 3.4478 23.9876 32.6896 32.1448 34.9067 9.0622 22.6035 76.8581 25.0120 1.7855 59.6269 4.3263 2.1838 23.0749 41.8407 15.5540 17.7787 68.5654 56.0167 44.8728 174.0239 76.4923 193.9146 22.6280 119.5429 149.7620 12.4485 26.0422 3.0315 3.8951 26.5014 49.6144 16.6055 68.2368 52.2189 42.5118 0.2207 8.3468 10.6650 20.8024 0.3940 3.8293 12.5190 78.0441 64.9476 75.3269 160.0928 12.5336 29.2263 191.3064 22.6822 23.4814 2.1956 19.1274 17.6143 0.9090 6.3715 1.3461 9.1242 15.5180 22.4730 17.2382 11.8705 1.2739 35.8667 0.4539 13.9611 12.2233 10.4209 5.8005 3.1437 8.7266 15.7312 18.4161 1.2873 1.1838 30.4809 0.6212 0.5587 57.5415 1.0410 17.9168 57.7276 23.8182 27.4686 17.1807 8.7905 12.9976 0.3694 7.8774 13.9199 17.8669 6.3646 213.8123 333.7347 148.2741 255.0088 27.1992 36.5270 235.2686 158.1193 113.1563 39.9223 1.7576 50.0232 20.6400 27.5698 42.0936 10.2193 9.5600 24.6735 18.5582 12.8570 18.0493 35.6867 2.7093 73.5224 41.1453 16.7600 8.0710 218.3364 113.1874 25.2559 1.6846 24.5273 29.2795 0.1907 9.5949 17.4976
temp: 298.150 k
press: 1.00000 atm
elementType: 8 8 8 8 8 8 8 7 7 7 7 6 6 6 6 6 6 6 6 6 6 6 6 6 6 6 1 1 1 1 1 1 1 1 1 1 1 1 1 1 1 1 1 1 1 1 1 1 1 1 1 1 1 1
symmnumber: 1
zpe: 1163404.5 jmol-1
zpe.correction: 0.443117 hartree
zpe.thermalcorrener: 0.473709 hartree
zpe.thermalcorrenthalpy: 0.474654 hartree
zpe.thermalcorrgfe: 0.377348 hartree
zpe.sumelectzpe: -1331.944964 hartree
zpe.sumelectthermal: -1331.914372 hartree
zpe.sumelectthermalent: -1331.913428 hartree
zpe.sumelectthermalfe: -1332.010733 hartree
dipole: 0.5990 4.4360 -0.2772
dipole: 4.4848
quadrupole: -137.4400 -143.1721 -164.2230
quadrupole: 16.4142 3.3692 1.9626
quadrupole: 10.8383 5.1063 -15.9446 16.4142 3.3692 1.9626
hfenergy: -1332.3880812 hartree
pointgroup: C01 [X(C15H28N4O7)]
dipole: 0.627592 1.6366709 -0.2019621 debye
polarizability: 241.2725193|-9.2639529|208.8464514|15.100498|-6.1917304|186.8451327 unknown
InChI: InChI=1S/C15H28N4O7/c1-8(20)12(17)14(24)18-9(4-2-3-7-16)13(23)19-10(15(25)26)5-6-11(21)22/h8-10,12,18-21,25H,2-7,16-17H2,1H3
charge 0 multiplicity 1
54 atoms
O  0.056385 -1.766883 1.917475
O  2.252662 2.699112 1.018474
O  -0.116412 0.617738 -1.907918
O  -4.440315 -2.829206 0.267386
O  -2.98819 -2.822032 -1.546385
O  -4.585018 2.56457 -1.362857
O  -3.745681 2.685212 0.795303
N  1.457966 0.387465 -0.204421
N  -1.097691 -1.346213 -0.070863
N  -0.045788 3.31539 -1.863719
N  7.572753 -2.496167 0.328243
C  1.342153 -1.086041 -0.1056
C  2.593552 -1.691968 0.55434
C  3.89294 -1.443892 -0.242339
C  5.121051 -2.105915 0.420686
C  0.050135 -1.444939 0.689807
C  -2.4274 -1.530574 0.506627
C  0.9897 2.658238 -1.063199
C  0.728838 1.130715 -1.087612
C  -3.169039 -0.178506 0.75491
C  1.016882 3.254072 0.379378
C  6.432886 -1.841178 -0.34557
C  -3.426544 0.620273 -0.539905
C  -3.259588 -2.451934 -0.385605
C  -0.232931 2.970734 1.21722
C  -3.912985 2.026186 -0.255947
H  1.228932 -1.47006 -1.138506
H  2.684552 -1.300471 1.586129
H  2.424083 -2.779727 0.662447
H  3.775299 -1.83893 -1.27302
H  4.072767 -0.354382 -0.346386
H  4.977079 -3.200871 0.496341
H  5.223444 -1.728107 1.460775
H  2.029722 0.918739 0.477841
H  -2.288955 -2.022989 1.487424
H  2.018844 2.807693 -1.467219
H  -1.000488 -0.999366 -1.036795
H  -2.552948 0.422717 1.446133
H  -4.124074 -0.39162 1.267112
H  1.150385 4.348779 0.262317
H  6.554189 -0.735619 -0.472631
H  6.347074 -2.269478 -1.363347
H  -4.156495 0.122054 -1.202519
H  -2.491831 0.72599 -1.129644
H  -0.341054 1.891689 1.429592
H  -0.197789 3.510097 2.182711
H  -1.129099 3.313371 0.67373
H  0.261715 4.143046 -2.377064
H  -0.571706 2.641768 -2.434334
H  8.44091 -2.50723 -0.215537
H  7.727576 -2.169687 1.287839
H  2.289598 2.994275 1.961635
H  -4.97552 -3.41727 -0.33175
H  -4.84293 3.505031 -1.159584
