program: Gaussian 09
title: 000129668
version: EM64L-G09RevD.01
frameworkgroup: C1[X(C12H16O3)]
method: RPBEPBE
basis: SDD
operation: Freq
keyword: #pfreq=noraman
keyword: PBEPBE/SDD
title: #p freq=noraman PBEPBE/SDD
converged: YES YES NO NO
title: Mulliken charges:
elementType: O O O C C C C C C C C C C C C H H H H H H H H H H H H H H H H
charge: -0.243969 -0.234925 -0.438588 0.567434 -0.547577 0.205789 0.193538 -0.364563 -0.450633 -0.518300 -0.336926 -0.127815 -0.318037 -0.537749 -0.539073 0.240539 0.206767 0.203096 0.217252 0.226445 0.239597 0.236868 0.225302 0.196162 0.218531 0.245967 0.218717 0.245897 0.219170 0.219767 0.331315
chargesum: 0.00000
title: Mulliken charges with hydrogens summed into heavy atoms:
elementType: O O O C C C C C C C C C C C C
charge: -0.243969 -0.234925 -0.107272 0.567434 -0.307038 0.205789 0.193538 -0.147311 -0.224187 -0.108437 -0.097329 0.109053 0.103427 0.145466 0.145761
polarizability: 2.44619797e+02 -6.45761968e+00 1.53072989e+02 8.37858878e+00 2.07408162e+00 8.10306806e+01
1716.lowfreq: -5.7029 -0.0003 -0.0001 0.0006 2.7339 6.2049 23.1372 53.7607 65.7328
frequency: 23.0763 53.7527 65.7289 88.8435 97.8024 111.0980 128.1036 158.3567 176.5701 217.0451 242.6939 247.3434 262.1298 288.6327 315.0576 339.9369 364.3572 384.7248 391.8983 462.0569 478.0448 506.8683 578.7353 595.7817 619.1055 732.0132 739.9522 742.8624 802.9599 822.9684 834.9347 878.0278 885.8108 919.1933 924.3081 983.7324 988.2629 989.5741 1002.5191 1042.1511 1107.0471 1112.4315 1112.7320 1125.1935 1130.2825 1147.1937 1157.9221 1189.5544 1212.7218 1227.0889 1264.7352 1276.4146 1297.1153 1310.4811 1315.7470 1344.6238 1373.1852 1394.2317 1413.6693 1437.5732 1442.5185 1447.4453 1467.1338 1467.7470 1470.6463 1471.7563 1473.2632 1511.7284 1583.5103 1608.5093 1665.2473 2929.9003 2953.9239 2955.9598 2957.5519 3017.6414 3039.8581 3042.4936 3066.1722 3085.9502 3107.1196 3123.2877 3124.8530 3141.8050 3144.3190 3165.0794 3554.6021
redmass: 4.6010 4.7385 3.7786 3.0593 2.3366 3.2777 3.9835 3.3562 3.5144 1.6433 1.5061 3.2033 1.5220 2.2650 1.5199 1.8540 3.4753 4.3792 3.4597 3.0895 6.1528 2.5109 4.7137 4.6846 3.4249 5.2482 4.2237 2.8020 1.4487 1.9531 1.8693 2.1682 2.2042 4.5275 1.4032 6.4504 1.2591 1.8265 3.5886 2.7249 1.9790 1.2614 1.2602 1.3795 2.2253 1.4247 1.4007 1.5725 1.2271 1.9540 3.0157 1.3339 1.5825 1.3894 1.3637 1.5419 1.2665 2.9416 2.9771 1.1846 1.3055 1.1355 1.0500 1.0502 1.0835 1.0842 1.0578 2.7314 7.0595 6.3517 6.1185 1.0655 1.0332 1.0345 1.0682 1.0922 1.1036 1.1037 1.0897 1.0961 1.0887 1.0988 1.0990 1.0872 1.0898 1.0954 1.0661
irintensity: 0.8222 3.0848 4.6418 8.8251 6.8440 0.3426 1.2084 0.8252 4.5795 1.6791 0.6912 2.2776 0.1924 8.8518 136.6361 60.1591 5.9292 14.0106 1.2848 2.0183 0.4996 22.6353 12.5233 4.7068 4.4359 24.2628 0.6812 0.2882 51.8898 4.9429 14.2790 10.1705 10.8113 7.1733 0.9334 33.9699 74.4019 129.1668 11.2121 12.8752 2.0827 0.0205 0.3827 66.9961 100.6380 2.0980 7.0494 33.2681 16.5071 91.1154 228.3440 12.5750 55.4047 1.4222 7.9262 4.4549 35.4074 5.7231 9.8671 16.1941 11.7098 5.6894 7.6258 18.3794 16.6948 72.1904 42.5978 155.9402 45.0158 36.8617 0.4907 49.1057 91.7285 81.5737 111.8184 34.5791 45.2913 57.9019 25.5396 29.6921 26.8989 23.7258 28.5803 6.6798 14.2942 12.3693 4.3030
temp: 298.150 k
press: 1.00000 atm
elementType: 8 8 8 6 6 6 6 6 6 6 6 6 6 6 6 1 1 1 1 1 1 1 1 1 1 1 1 1 1 1 1
symmnumber: 1
zpe: 666660.8 jmol-1
zpe.correction: 0.253918 hartree
zpe.thermalcorrener: 0.270043 hartree
zpe.thermalcorrenthalpy: 0.270988 hartree
zpe.thermalcorrgfe: 0.209318 hartree
zpe.sumelectzpe: -691.341625 hartree
zpe.sumelectthermal: -691.325499 hartree
zpe.sumelectthermalent: -691.324555 hartree
zpe.sumelectthermalfe: -691.386225 hartree
dipole: -0.9188 1.2720 -1.2080
dipole: 1.9802
quadrupole: -84.7854 -72.1111 -92.7981
quadrupole: -11.4087 8.1373 3.4362
quadrupole: -1.5538 11.1204 -9.5666 -11.4087 8.1373 3.4362
hfenergy: -691.5955428 hartree
pointgroup: C01 [X(C12H16O3)]
dipole: 0.3694779 0.4707433 0.4988575 debye
polarizability: 244.6988583|3.6240881|152.8589548|10.250727|0.6655189|81.1656543 unknown
InChI: InChI=1S/C12H16O3/c1-14-11-7-6-10(5-3-4-8-13)9-12(11)15-2/h3,5-7,9,13H,4,8H2,1-2H3
charge 0 multiplicity 1
31 atoms
O  -3.130412 1.58489 -0.070833
O  -3.68167 -1.008011 -0.146504
O  5.524182 -1.457167 -0.243948
C  0.392009 0.209499 0.149305
C  -0.68386 1.144243 0.08886
C  -2.02573 0.725569 -0.008007
C  -2.32616 -0.673912 -0.048769
C  1.770891 0.728773 0.253688
C  0.075826 -1.170976 0.105165
C  4.302557 0.615309 0.468786
C  -1.263193 -1.604313 0.007885
C  2.921524 0.00695 0.379681
C  5.305461 -0.026471 -0.519608
C  -2.861108 3.022267 -0.033022
C  -4.014466 -2.432655 -0.194872
H  -0.44966 2.213795 0.12165
H  4.252694 1.705927 0.27775
H  4.712994 0.494204 1.497002
H  1.858507 1.827115 0.229916
H  0.873924 -1.919364 0.139407
H  -1.474999 -2.677215 -0.026713
H  2.892984 -1.091389 0.407618
H  4.906207 -0.00315 -1.546666
H  6.268534 0.527629 -0.497777
H  -2.363393 3.316708 0.912208
H  -3.850529 3.498687 -0.094803
H  -2.239013 3.340782 -0.892909
H  -5.111224 -2.46543 -0.269539
H  -3.686364 -2.956343 0.72464
H  -3.564664 -2.923399 -1.080463
H  5.913652 -1.547851 0.662871
