program: Gaussian 09
title: 000129680
version: EM64L-G09RevD.01
frameworkgroup: C1[X(C10H21N5O2)]
method: RPBEPBE
basis: SDD
operation: Freq
keyword: #p
keyword: freq=noraman
keyword: PBEPBE/SDD
title: #p freq=noraman PBEPBE/SDD
converged: YES YES NO NO
title: Mulliken charges:
elementType: O O N N N N N C C C C C C C C C C H H H H H H H H H H H H H H H H H H H H H
charge: -0.317239 -0.296286 -0.399465 -0.378707 -0.214136 -0.654505 -0.648784 -0.123234 -0.448094 -0.419968 0.112647 -0.449983 -0.360063 0.247032 -0.660992 -0.778250 0.284154 0.263278 0.217136 0.285697 0.214663 0.220167 0.203004 0.221517 0.339332 0.421032 0.199033 0.259351 0.248160 0.192986 0.211607 0.243923 0.246623 0.217384 0.315798 0.346996 0.334699 0.303483
chargesum: 0.00000
title: Mulliken charges with hydrogens summed into heavy atoms:
elementType: O O N N N N N C C C C C C C C C C
charge: -0.317239 -0.296286 -0.060132 0.042325 -0.214136 0.008288 -0.010601 0.140045 0.054738 0.014861 0.112647 -0.025461 0.098322 0.247032 -0.008239 -0.070319 0.284154
polarizability: 2.04916100e+02 6.02727982e+00 1.52333241e+02 7.76099804e+00 -2.95048867e+00 1.08476411e+02
1716.lowfreq: -0.0007 -0.0002 0.0005 1.4068 4.9462 7.3205 26.7819 32.8999 41.2228
frequency: 26.6901 32.8741 41.2076 54.9779 62.7315 74.4892 80.9150 93.0247 105.8076 135.0474 148.7960 173.3723 201.5073 220.7313 222.3823 255.5404 260.9550 296.0055 314.3669 335.1485 363.1636 406.0218 422.2812 432.1565 440.4256 483.6332 500.1058 518.6537 534.7508 555.4499 579.5689 602.5484 642.2364 674.3253 686.0961 748.3838 779.3560 793.9011 826.3856 859.5112 889.1186 913.6386 940.5867 964.2497 981.6961 989.1131 1001.4808 1030.7785 1042.5065 1045.7908 1056.2227 1071.6930 1088.8046 1113.8678 1144.9094 1155.4340 1176.0568 1185.6482 1222.2406 1235.5845 1281.2277 1282.3623 1293.1432 1302.8705 1327.5256 1340.0257 1346.6371 1355.7672 1370.2413 1383.5259 1385.3913 1436.0933 1451.4598 1459.3792 1460.7455 1463.9278 1466.1544 1469.7125 1478.7682 1483.8747 1485.6114 1585.5433 1606.7963 1610.1423 1618.4236 1621.9570 1667.1968 2884.1400 2898.7093 2937.2018 2946.2104 2974.6357 2987.8659 2995.5693 2997.0718 3003.5271 3050.0667 3052.5015 3072.6157 3073.3003 3093.3474 3093.9169 3102.6159 3449.2173 3540.7812 3560.8162 3685.0134 3701.9629
redmass: 2.7254 4.0128 4.6409 3.7024 2.9994 1.5882 2.5833 4.3938 4.4073 2.9709 3.8849 3.0692 2.4749 1.7163 2.9103 4.5909 2.0414 2.4634 1.2872 2.5365 3.4474 1.4741 2.4281 1.6608 1.4042 2.2474 3.1675 1.2003 4.2902 3.5428 3.1883 3.7257 2.5638 7.1391 1.2561 2.0708 2.2107 1.9408 2.2159 2.4258 2.5344 2.6537 2.5689 2.9032 1.2320 2.3569 1.6718 1.4532 1.6511 2.1661 2.1624 2.7188 2.1568 2.4599 1.8684 1.7668 2.2082 1.4683 1.2935 1.3788 1.3018 1.3696 1.8549 1.3930 1.2717 1.6859 1.4713 1.3801 1.4342 1.2184 1.2397 3.8250 1.0468 1.1446 1.0972 1.1347 1.0801 1.0933 1.8004 1.0784 1.0974 6.6545 1.6900 2.3076 1.3459 1.4848 2.7214 1.0784 1.0776 1.0806 1.0984 1.0369 1.0631 1.0358 1.0654 1.0617 1.1012 1.0982 1.0989 1.0993 1.0983 1.1005 1.1007 1.0772 1.0454 1.0456 1.1029 1.1036
irintensity: 0.3485 0.2373 1.8680 1.6546 2.4581 3.9625 9.0527 1.7114 0.3527 10.3932 7.4613 6.0697 2.9718 12.0448 7.5851 2.1664 18.6882 0.5593 59.0594 6.8572 11.0297 124.8320 32.0271 130.6319 17.1195 7.5445 10.5700 269.1883 5.3181 13.9615 10.2445 15.1159 7.1618 23.1479 75.2739 4.4284 8.1661 6.6152 14.6907 22.2833 27.7017 4.4212 1.4134 19.5828 63.5899 19.9941 5.4553 6.6023 15.7914 6.1059 3.5585 5.1593 9.7029 5.2643 2.7586 23.4381 9.6102 13.6435 1.2281 3.5054 16.2530 48.1244 114.4448 16.2570 4.8818 71.6229 8.4788 5.0039 11.5822 18.2659 62.5992 113.1503 13.3269 61.0812 48.6428 100.6648 20.0457 4.3794 364.3239 27.0121 25.6238 276.2322 216.1029 130.0387 98.4861 95.7744 548.3314 884.6509 401.8517 31.4234 38.1667 36.1745 83.8335 13.2175 2.9185 61.4485 16.3509 7.4460 35.4884 39.1246 13.3977 36.3638 20.4534 112.1348 34.5289 30.3376 38.7081 28.3117
temp: 298.150 k
press: 1.00000 atm
elementType: 8 8 7 7 7 7 7 6 6 6 6 6 6 6 6 6 6 1 1 1 1 1 1 1 1 1 1 1 1 1 1 1 1 1 1 1 1 1
symmnumber: 1
zpe: 845583.6 jmol-1
zpe.correction: 0.322066 hartree
zpe.thermalcorrener: 0.342311 hartree
zpe.thermalcorrenthalpy: 0.343255 hartree
zpe.thermalcorrgfe: 0.271615 hartree
zpe.sumelectzpe: -816.553537 hartree
zpe.sumelectthermal: -816.533291 hartree
zpe.sumelectthermalent: -816.532347 hartree
zpe.sumelectthermalfe: -816.603987 hartree
dipole: 8.7073 -2.1753 -1.3738
dipole: 9.0795
quadrupole: -79.0241 -103.4240 -107.1540
quadrupole: -11.2385 11.3037 8.3470
quadrupole: 17.5099 -6.8900 -10.6200 -11.2385 11.3037 8.3470
hfenergy: -816.8756024 hartree
pointgroup: C01 [X(C10H21N5O2)]
dipole: -3.4175925 1.0076166 0.2547623 debye
polarizability: 184.2710287|-25.5244927|171.0750407|14.6072603|-4.3468188|110.3796822 unknown
InChI: InChI=1S/C10H21N5O2/c1-3-13-9(17)8(15-7(2)16)5-4-6-14-10(11)12/h8,13,15H,3-6,11-12H2,1-2H3
charge 0 multiplicity 1
38 atoms
O  2.470838 1.361945 0.801897
O  2.555989 -3.206756 -0.863483
N  2.49334 -1.283611 0.454189
N  0.246966 1.545064 0.114196
N  -2.290623 0.295578 -0.031315
N  -4.692078 0.12159 -0.197437
N  -3.602047 2.151281 -0.644927
C  1.498026 -0.562538 -0.362181
C  0.144586 -1.297985 -0.507646
C  -0.705874 -1.418943 0.78486
C  1.429222 0.869296 0.238806
C  -2.18993 -1.083049 0.510699
C  0.119856 2.926175 0.614441
C  2.991168 -2.525436 0.121931
C  0.277825 3.977389 -0.507116
C  4.101824 -3.049012 1.032506
C  -3.478059 0.807493 -0.280588
H  1.90791 -0.452928 -1.391705
H  -0.43821 -0.75173 -1.274536
H  0.369709 -2.2933 -0.926697
H  -0.638524 -2.441505 1.199829
H  -0.332292 -0.733651 1.568785
H  -2.58781 -1.82801 -0.218448
H  -2.779028 -1.192071 1.449531
H  2.998656 -0.675555 1.112126
H  -0.660976 1.047693 -0.111354
H  -0.870831 3.023355 1.10076
H  0.896844 3.087034 1.382566
H  1.281113 3.901678 -0.960333
H  -0.468566 3.829371 -1.31105
H  0.15635 4.999862 -0.103147
H  3.755169 -3.970034 1.53355
H  4.973774 -3.321916 0.413705
H  4.416506 -2.322947 1.801621
H  -5.573706 0.621872 -0.117994
H  -4.691153 -0.879736 -0.027442
H  -2.746787 2.703143 -0.658503
H  -4.368276 2.449892 -1.244798
