program: Gaussian 09
title: 000129661
version: EM64L-G09RevD.01
frameworkgroup: C1[X(C8H11N3O4)]
method: RPBEPBE
basis: SDD
operation: Freq
keyword: #p
keyword: freq=noraman
keyword: PBEPBE/SDD
title: #p freq=noraman PBEPBE/SDD
converged: YES YES NO NO
title: Mulliken charges:
elementType: O O O O N N N C C C C C C C C H H H H H H H H H H H
charge: -0.401770 -0.259028 -0.237062 -0.247499 -0.153242 -0.649460 -0.400834 -0.364725 -0.368320 -0.183307 0.212919 -0.082262 0.150983 -0.300375 0.148819 0.262643 0.222346 0.251180 0.264273 0.268460 0.258345 0.318018 0.285458 0.358935 0.255987 0.389519
chargesum: 0.00000
title: Mulliken charges with hydrogens summed into heavy atoms:
elementType: O O O O N N N C C C C C C C C
charge: -0.012251 -0.259028 -0.237062 -0.247499 -0.153242 -0.045984 -0.041899 0.120264 0.147132 0.085153 0.212919 0.176083 0.150983 -0.044388 0.148819
polarizability: 1.63836779e+02 -6.52072546e+00 1.19457660e+02 1.15909108e+01 1.84406409e+00 7.59196882e+01
1716.lowfreq: -8.9057 -0.0010 -0.0005 0.0004 3.3951 10.2141 19.9239 30.7952 40.1288
frequency: 19.2300 30.7835 40.1111 55.0658 76.4190 152.2850 153.8661 173.0321 203.2411 257.8327 312.7152 333.4210 340.9521 372.0200 415.7750 420.3936 480.2523 515.6343 522.4188 569.5323 592.8475 608.6666 644.3218 684.6667 702.4258 710.7685 741.0706 767.2899 772.3430 786.2788 805.8118 830.2036 929.5049 942.3487 948.4527 1002.1852 1045.1697 1057.6517 1084.4487 1130.9254 1171.7382 1182.4420 1204.5487 1211.3503 1224.5992 1272.2502 1283.3816 1307.4983 1329.4255 1348.3310 1368.5007 1372.8640 1381.6090 1422.0568 1457.0513 1474.8508 1601.1066 1615.0643 1645.9237 1663.4650 1666.0298 2955.0714 3006.4678 3024.7755 3075.7563 3098.7966 3163.1402 3216.2283 3477.6716 3520.9697 3525.2345 3621.4741
redmass: 6.1112 6.1011 8.5003 5.9460 5.4384 5.4319 4.2543 8.1841 1.1661 2.9620 3.0379 5.2007 3.3838 8.7089 4.7120 3.3430 4.2065 5.8571 2.9612 4.1533 4.1606 1.3383 1.5623 2.8784 2.3733 4.4123 5.3248 1.8611 1.7416 2.3842 1.9183 3.6302 2.6615 3.2338 1.3052 2.0786 2.8240 2.0669 2.4654 1.4521 5.4935 1.7061 1.6494 1.9321 1.4056 1.5803 1.3740 2.3896 1.5659 1.4004 1.4029 1.7066 1.7796 3.2741 1.1010 1.1098 5.4483 1.4917 9.4877 3.1944 4.8155 1.0824 1.0627 1.0591 1.1004 1.1060 1.0918 1.0970 1.0474 1.0643 1.0769 1.0974
irintensity: 0.7668 1.3176 1.5963 1.9767 0.1617 0.3846 1.0860 4.9732 25.0313 3.8088 0.8124 8.7601 1.0694 22.9913 6.3140 20.7118 28.6309 12.5841 72.2536 37.4681 10.8244 28.0615 276.3873 17.6225 5.3898 38.4595 3.6113 34.0197 23.6082 18.1876 106.7713 2.9430 0.5589 2.4575 0.6362 1.9064 111.6690 105.5844 25.4093 8.7019 14.3978 49.9764 13.6797 46.7931 27.6831 17.5684 19.5961 80.0964 18.7881 41.3085 2.9790 20.1528 7.8747 94.9974 2.1007 21.2298 8.5893 225.9399 249.3055 410.5937 508.9089 29.2840 16.1051 17.4346 5.3176 11.8044 3.2891 0.6556 16.2833 34.2449 54.5741 19.6749
temp: 298.150 k
press: 1.00000 atm
elementType: 8 8 8 8 7 7 7 6 6 6 6 6 6 6 6 1 1 1 1 1 1 1 1 1 1 1
symmnumber: 1
zpe: 521105.5 jmol-1
zpe.correction: 0.198479 hartree
zpe.thermalcorrener: 0.213153 hartree
zpe.thermalcorrenthalpy: 0.214097 hartree
zpe.thermalcorrgfe: 0.154170 hartree
zpe.sumelectzpe: -775.504422 hartree
zpe.sumelectthermal: -775.489747 hartree
zpe.sumelectthermalent: -775.488803 hartree
zpe.sumelectthermalfe: -775.548730 hartree
dipole: -5.0095 -2.8366 1.2559
dipole: 5.8923
quadrupole: -109.4312 -79.1944 -89.3121
quadrupole: -0.0771 -8.3016 -1.7016
quadrupole: -16.7853 13.4515 3.3338 -0.0771 -8.3016 -1.7016
hfenergy: -775.7029003 hartree
pointgroup: C01 [X(C8H11N3O4)]
dipole: 1.9526777 -1.1443109 -0.5016651 debye
dipolederiv: -0.4183935 -0.015012 0.0765041 -0.0312594 -1.0041462 0.4103623 0.0768562 0.3362473 -0.4615016 -0.7473641 -0.2920424 -0.0233673 -0.3507029 -1.0806503 -0.0351256 -0.0075838 -0.0088219 -0.3633668 -0.5719942 0.0496474 -0.2914803 -0.1372723 -0.5791988 -0.0097066 -0.3651802 0.1984439 -0.7706037 -1.423608 -0.0129815 -0.0960306 0.2081378 -0.4796778 0.0245151 -0.1384093 0.0039294 -0.3848363 -0.9103185 0.1525727 -0.005681 -0.7041277 -1.0260176 -0.0366062 -0.0004952 0.0733887 -0.1739205 -0.7927677 -0.0384794 0.1182133 0.0955959 -0.5954239 0.1949166 0.0590381 0.1617199 -0.3720958 -1.1451751 -0.33312 -0.0546034 -0.388198 -0.533036 -0.0390316 -0.0726197 -0.0336578 -0.3514268 -0.0497011 0.1290884 -0.0004925 0.0225388 0.0260043 -0.0133533 -0.0011867 0.0400738 0.020683 0.6570382 -0.0578966 -0.0274626 0.0524116 0.0983961 -0.0147599 -0.0187122 -0.0064517 0.1810389 0.2616819 -0.2848584 -0.097544 -0.2605234 0.3645246 -0.1907337 -0.1265067 -0.2896251 0.1295109 1.2554646 0.1191969 0.0861268 0.2904169 1.604554 0.0185423 0.0718754 -0.051314 0.3026735 0.9673571 0.2281998 0.0734286 0.7729331 0.4239648 0.0287418 0.0906036 -0.0037625 -0.0073922 0.6207563 0.0889735 0.4068498 0.3549594 1.2046898 -0.2587807 0.5610034 -0.3178026 0.9838939 -0.8479187 0.0677774 -0.0368236 0.4338268 -0.235852 0.0393114 -0.0937715 0.0059503 -0.2555851 1.8308743 0.125779 0.1529546 -0.2071438 0.9239277 -0.0399791 0.1983328 -0.0193864 0.2867297 0.0829945 0.0399551 0.0038362 0.0221767 -0.0301494 0.0952739 -0.0018584 0.0464921 0.0253041 -0.0212901 -0.0843044 -0.0579721 -0.0698868 -0.0240522 -0.1059411 -0.0235513 -0.0714333 -0.0013405 0.0919589 -0.020568 -0.013486 -0.0325742 0.0184895 0.1100862 -0.0049713 0.0566257 0.027818 0.0233782 -0.0101168 -0.0052209 -0.0870205 0.0216231 -0.0822265 -0.0076444 -0.0367711 0.0410885 -0.0292125 0.0103825 0.0748289 -0.001369 0.014334 0.017307 0.0933347 0.0536484 -0.0980704 0.0687405 0.0886633 -0.0226028 0.0571036 0.0064882 0.0100349 -0.0250093 0.0139784 0.1441754 0.2369963 0.0741003 -0.1060697 0.013912 0.2486478 -0.0403177 -0.068604 0.0118104 0.2166046 0.3036912 0.0975879 -0.0229542 0.0451346 0.1384265 -0.0436438 -0.010627 -0.076887 0.1320153 0.1634603 -0.0325768 -0.0177196 -0.0564337 0.1889045 0.0035686 -0.0206357 0.0056963 0.3327756 0.0612943 -0.0459193 -0.0102938 -0.015745 0.010268 0.0075512 -0.0173275 0.0074446 0.1885561 0.332057 -0.0440485 -0.102938 -0.0268905 0.2949616 -0.0500055 -0.1463499 -0.0995359 0.2272721 unknown
polarizability: 164.1658366|6.0044921|119.2707277|10.8627911|-2.3114222|75.7775634 unknown
InChI: InChI=1S/C8H11N3O4/c9-5(7(13)14)1-3-11-4-2-6(12)10-8(11)15/h2,4-5,10,13H,1,3,9H2
charge 0 multiplicity 1
26 atoms
O  3.484463 1.543574 -0.681627
O  -0.79205 2.11531 0.167464
O  4.196705 0.198139 1.073885
O  -4.957247 0.010501 -0.221111
N  -0.863503 -0.236055 0.295269
N  3.007936 -2.047233 -0.0234
N  -2.852605 1.009871 -0.010889
C  1.324469 -0.407819 -0.927552
C  0.612413 -0.300103 0.43562
C  2.832299 -0.782721 -0.749144
C  -1.45963 1.044922 0.149942
C  -1.625945 -1.399614 0.255492
C  3.577978 0.329844 -0.006184
C  -2.990228 -1.397829 0.088919
C  -3.711968 -0.135698 -0.061002
H  1.237566 0.539704 -1.487138
H  0.858355 -1.213184 -1.526085
H  0.871467 -1.183353 1.045831
H  0.92926 0.614671 0.964181
H  3.272056 -0.815676 -1.769338
H  -1.059615 -2.32817 0.373251
H  3.6212 -1.975247 0.794732
H  3.183862 -2.865922 -0.606442
H  -3.306975 1.923343 -0.111425
H  -3.563231 -2.324914 0.069688
H  3.947069 2.258658 -0.166638
