program: Gaussian 09
title: 000129678
version: EM64L-G09RevD.01
frameworkgroup: C1[X(C16H18O3)]
method: RPBEPBE
basis: SDD
operation: Freq
keyword: #pfreq=noraman
keyword: PBEPBE/SDD
title: #p freq=noraman PBEPBE/SDD
converged: YES YES NO NO
title: Mulliken charges:
elementType: O O O C C C C C C C C C C C C C C C C H H H H H H H H H H H H H H H H H H
charge: -0.246435 -0.408904 -0.234876 -0.399724 -0.398136 -0.557710 -0.497386 0.327492 0.061559 -0.401830 0.445062 0.507788 -0.327386 -0.391795 -0.402472 -0.398546 -0.472530 -0.695079 0.177280 0.217317 0.207054 0.218972 0.207676 0.220358 0.214088 0.227878 0.247818 0.198937 0.246846 0.318230 0.223650 0.258890 0.234568 0.229368 0.244110 0.222348 0.375523
chargesum: 0.00000
title: Mulliken charges with hydrogens summed into heavy atoms:
elementType: O O O C C C C C C C C C C C C C C C C
charge: -0.246435 -0.033382 -0.234876 0.024646 0.028511 -0.123265 -0.021689 0.327492 0.061559 -0.202893 0.445062 0.507788 -0.080540 -0.073565 -0.178822 -0.139656 -0.237962 0.000746 0.177280
polarizability: 3.05504447e+02 -8.09468858e+00 1.69247651e+02 2.94483507e+00 1.26230339e+01 1.24860534e+02
1716.lowfreq: -6.6156 -3.4345 -0.0002 0.0002 0.0007 4.2991 21.5919 26.0647 37.8960
frequency: 21.5575 25.7668 37.8579 58.5249 64.2956 82.4953 115.6805 125.1589 171.4560 199.9058 214.7844 229.4103 251.1738 266.9748 310.0055 317.6371 342.9557 386.4751 411.2489 417.5269 435.5076 468.4124 482.4187 536.0491 565.3658 600.1469 615.3882 633.4371 639.1315 652.6400 700.2408 706.6866 744.8959 782.2997 809.4298 819.2980 829.6473 837.5035 876.3606 880.3642 891.7168 929.9618 932.7349 965.9654 970.6889 992.0395 1014.3017 1022.7070 1032.2872 1068.9230 1071.4832 1084.0849 1091.9081 1103.3467 1125.1358 1135.0247 1141.3504 1192.8667 1204.8566 1212.7794 1236.5179 1238.0317 1244.9992 1259.0771 1275.3932 1308.9306 1317.6257 1331.3375 1335.8140 1344.1318 1347.7415 1374.8120 1390.9550 1406.6666 1426.6487 1441.5920 1462.3627 1466.7367 1468.7911 1475.8583 1476.9129 1496.9628 1546.9019 1568.5365 1613.0847 1616.3689 1659.9759 2950.1085 2962.2192 2980.0004 2982.9699 2995.5422 3027.7082 3038.9321 3043.9823 3048.6290 3049.9935 3067.1253 3092.7810 3109.2443 3112.0442 3134.3011 3138.6355 3167.8009 3505.2998
redmass: 4.0693 5.1753 7.6586 3.7114 6.2323 3.9751 3.6599 4.8143 3.3918 5.0364 1.0471 3.9390 3.0721 4.1166 3.8205 2.2683 4.3265 3.3061 3.2116 3.5689 3.6641 3.5834 3.3922 2.8110 2.7987 2.8787 2.0588 5.7011 2.1550 3.7029 3.4288 4.1259 3.3373 3.4341 2.7748 1.6275 2.9790 1.5841 1.5302 2.2711 1.5428 2.5292 1.4210 1.5203 2.3362 2.1674 2.8990 1.3200 2.4625 1.5795 1.8608 1.4716 2.2296 1.9468 1.4818 2.1553 1.8648 1.8992 1.9701 1.3591 1.4692 1.5786 1.7148 1.2877 1.5560 1.4356 1.4019 1.4229 1.3951 1.9581 1.5349 2.4265 1.1968 2.5122 1.8596 1.0858 1.0980 1.0858 1.0533 1.0901 1.0549 2.3849 9.0181 6.4089 6.4487 6.9484 8.1744 1.0649 1.0663 1.0603 1.0631 1.0353 1.0954 1.0992 1.0850 1.0941 1.0948 1.0952 1.1002 1.1000 1.0873 1.0910 1.0957 1.0954 1.0638
irintensity: 0.3590 1.2273 1.5756 1.1203 1.1756 0.8202 0.2140 1.4732 0.4854 2.5452 0.3255 2.1150 1.0858 0.8470 1.2224 5.0939 0.2306 3.4601 7.0593 8.0714 0.9457 5.6697 5.8088 9.9100 48.3889 38.9987 36.5384 14.0974 45.7683 10.7422 32.1572 24.4964 1.7189 1.9062 5.3560 24.7218 19.6278 12.2255 1.4780 6.9199 20.9061 19.1209 18.0011 6.9786 14.6719 5.9455 15.1272 6.8129 282.9893 22.3215 13.6674 10.3313 27.4644 33.0440 9.8473 62.8701 12.3746 10.2502 32.4576 6.7076 10.6662 3.0994 9.9335 17.9148 5.0846 4.1667 5.1460 4.3905 0.3827 43.0875 0.2310 21.8412 19.4066 21.6790 19.8351 14.6774 23.3723 13.9893 8.5074 6.7664 12.0467 35.1636 101.5980 32.9193 73.8074 27.7454 185.6967 29.8951 10.3964 32.0420 53.0169 31.2810 26.7114 62.8375 8.5038 60.8142 27.7574 26.5454 38.9510 15.6265 13.5810 11.6515 15.7790 29.5115 22.0990
temp: 298.150 k
press: 1.00000 atm
elementType: 8 8 8 6 6 6 6 6 6 6 6 6 6 6 6 6 6 6 6 1 1 1 1 1 1 1 1 1 1 1 1 1 1 1 1 1 1
symmnumber: 1
zpe: 791870.2 jmol-1
zpe.correction: 0.301607 hartree
zpe.thermalcorrener: 0.319636 hartree
zpe.thermalcorrenthalpy: 0.320580 hartree
zpe.thermalcorrgfe: 0.253275 hartree
zpe.sumelectzpe: -844.779594 hartree
zpe.sumelectthermal: -844.761566 hartree
zpe.sumelectthermalent: -844.760622 hartree
zpe.sumelectthermalfe: -844.827927 hartree
dipole: 1.8821 3.1467 2.2041
dipole: 4.2781
quadrupole: -90.8530 -113.0913 -111.5998
quadrupole: -2.5193 0.8519 -5.1220
quadrupole: 14.3283 -7.9100 -6.4184 -2.5193 0.8519 -5.1220
hfenergy: -845.0812019 hartree
pointgroup: C01 [X(C16H18O3)]
dipole: -0.8474247 0.637734 -1.30694 debye
polarizability: 303.9120579|13.6022316|149.3926628|-9.6402623|-26.3850265|146.3079113 unknown
InChI: InChI=1S/C16H18O3/c1-11(16(18)19)13-8-6-12(7-9-13)10-14-4-2-3-5-15(14)17/h6-11,18H,2-5H2,1H3
charge 0 multiplicity 1
37 atoms
O  -2.019393 -1.07987 1.839313
O  4.790503 -1.163166 -1.812501
O  4.656814 -1.654344 0.452048
C  -5.259596 -0.137581 -0.722495
C  -5.383263 -1.223707 0.365381
C  -4.271276 0.961385 -0.264219
C  -4.000288 -1.84419 0.673447
C  -2.88472 0.419909 0.111493
C  -2.889427 -0.821134 0.951615
C  -1.769832 1.081729 -0.368227
C  -0.309851 0.892274 -0.281815
C  2.558585 0.698345 -0.33862
C  4.093468 0.631899 -0.346938
C  0.394655 0.11056 0.684261
C  0.468765 1.588785 -1.258207
C  1.799086 0.015122 0.646151
C  1.871391 1.487834 -1.293569
C  4.706407 1.264601 0.928865
C  4.535706 -0.824535 -0.475594
H  -6.247894 0.315891 -0.928549
H  -4.903932 -0.592367 -1.668507
H  -6.084012 -2.019213 0.049243
H  -5.80227 -0.773443 1.287331
H  -4.710073 1.463342 0.624941
H  -4.167697 1.738731 -1.044325
H  -3.669299 -2.431159 -0.210481
H  -4.037307 -2.540722 1.529013
H  -2.024178 1.923685 -1.034864
H  4.459109 1.16323 -1.242555
H  -0.17357 -0.396813 1.467286
H  -0.043338 2.206675 -2.006999
H  2.312955 -0.59848 1.395476
H  2.437742 2.024705 -2.063886
H  4.356762 2.305591 1.036485
H  4.406724 0.697822 1.826066
H  5.809973 1.265683 0.878324
H  5.029372 -2.128977 -1.865388
