program: Gaussian 09
title: 000129646
version: EM64L-G09RevD.01
frameworkgroup: C1[X(C11H17NO)]
method: RPBEPBE
basis: SDD
operation: Freq
keyword: #p
keyword: freq=noraman
keyword: PBEPBE/SDD
title: #p freq=noraman PBEPBE/SDD
converged: YES YES NO NO
title: Mulliken charges:
elementType: O N C C C C C C C C C C C H H H H H H H H H H H H H H H H H
charge: -0.436337 -0.302739 -0.026269 -0.617019 0.511400 -0.713564 -0.324092 -0.375779 -0.404292 -0.699364 -0.391944 -0.351457 0.278454 0.196548 0.192214 0.231840 0.240444 0.234760 0.218426 0.217904 0.214848 0.175115 0.230228 0.238128 0.200525 0.232164 0.213794 0.215814 0.248746 0.351502
chargesum: 0.00000
title: Mulliken charges with hydrogens summed into heavy atoms:
elementType: O N C C C C C C C C C C C
charge: -0.084834 -0.062295 0.170279 -0.192965 0.511400 -0.042474 0.065872 -0.145550 -0.166164 -0.052881 -0.176129 -0.102711 0.278454
polarizability: 1.82347134e+02 -1.44164441e+00 1.19690306e+02 -1.24052615e+01 -7.07199862e+00 8.94138559e+01
1716.lowfreq: -10.4797 -3.4188 -0.0009 -0.0003 0.0004 7.9732 34.0796 36.6801 53.1402
frequency: 33.9297 36.6011 52.9993 78.0913 97.6373 141.6233 184.6894 211.6534 252.2601 278.0379 316.6609 332.2259 346.3462 359.0583 404.3493 410.5311 441.6730 476.9773 502.7086 551.9458 636.6827 662.0173 715.2302 762.6665 801.8736 811.9409 821.5146 830.5793 852.5007 888.4431 906.4617 927.3207 957.1950 963.5395 1004.3731 1048.1996 1057.1844 1091.2218 1113.0240 1125.3252 1144.2257 1153.1394 1178.1177 1181.6485 1212.6865 1222.8179 1245.4776 1253.8084 1281.1845 1313.1924 1322.8801 1342.5498 1356.8716 1379.2018 1389.9239 1390.6111 1424.4096 1458.4394 1466.3878 1469.5739 1475.7095 1480.5714 1482.9931 1498.3945 1503.8606 1597.7386 1626.8254 2827.5798 2847.4560 2960.4853 2976.6158 2983.9304 3013.6130 3041.4203 3069.8190 3080.7885 3089.1537 3090.6836 3106.5709 3128.3528 3133.3406 3169.2792 3405.2411 3582.6106
redmass: 2.9832 3.6635 3.8533 1.8555 2.5255 3.9505 4.2065 1.2285 1.1608 2.8252 3.1909 3.1145 1.1195 3.0132 3.0003 2.9064 2.3914 3.1219 3.0205 2.6748 6.7140 1.5669 3.6441 3.6338 1.5529 1.1461 1.6785 3.3447 2.1219 1.3723 1.7880 1.3817 1.5385 1.6927 2.7825 1.7224 2.2502 1.7801 1.4801 1.5416 1.3782 2.6892 1.2170 1.9672 1.6046 1.9836 2.9215 1.1499 1.2611 1.3523 1.2825 1.4265 1.3910 1.2347 1.7831 2.4343 2.7992 1.1517 1.0697 1.0826 1.1000 1.0469 1.0738 1.0868 2.7706 6.4312 6.4695 1.0812 1.0723 1.0645 1.0374 1.0357 1.0855 1.0964 1.0977 1.0993 1.0994 1.1001 1.0872 1.0906 1.0953 1.0954 1.0737 1.0660
irintensity: 0.0583 0.0205 0.0389 1.9267 1.3403 0.4284 0.5722 0.3796 1.2914 1.5689 1.8099 3.3198 143.0149 4.5587 8.2313 1.6716 2.8730 3.4089 20.2768 51.3604 0.5203 57.1299 2.1122 15.0208 40.9205 3.1357 12.9011 8.7669 22.8594 3.2518 0.9196 0.1072 0.3002 0.6219 3.3894 12.1818 8.0156 18.2662 19.9483 19.3338 215.4488 31.5206 20.2304 35.6802 7.2945 6.4677 31.2744 16.1972 5.1651 17.9734 5.2081 31.6280 3.2618 21.9948 4.3564 24.1241 12.7404 21.6946 5.9356 0.6083 32.4460 15.9846 1.8968 8.1672 91.8052 7.7351 30.9276 73.9730 131.2216 46.2830 37.5933 15.5885 25.7411 19.0812 56.8983 40.9635 32.1158 38.5610 20.4951 22.5439 10.8325 6.9045 4.3500 36.6821
temp: 298.150 k
press: 1.00000 atm
elementType: 8 7 6 6 6 6 6 6 6 6 6 6 6 1 1 1 1 1 1 1 1 1 1 1 1 1 1 1 1 1
symmnumber: 1
zpe: 674977.8 jmol-1
zpe.correction: 0.257085 hartree
zpe.thermalcorrener: 0.271243 hartree
zpe.thermalcorrenthalpy: 0.272187 hartree
zpe.thermalcorrgfe: 0.215082 hartree
zpe.sumelectzpe: -558.324986 hartree
zpe.sumelectthermal: -558.310828 hartree
zpe.sumelectthermalent: -558.309884 hartree
zpe.sumelectthermalfe: -558.366989 hartree
dipole: 0.6018 -2.4393 0.6616
dipole: 2.5981
quadrupole: -79.1585 -73.1118 -81.6885
quadrupole: 4.8640 -1.8481 -2.0585
quadrupole: -1.1723 4.8745 -3.7022 4.8640 -1.8481 -2.0585
hfenergy: -558.5820713 hartree
pointgroup: C01 [X(C11H17N1O1)]
dipole: 0.2308422 -0.885809 0.4548336 debye
polarizability: 182.5368132|-3.9958896|115.5618041|-11.0658555|-12.5949671|93.3526791 unknown
InChI: InChI=1S/C11H17NO/c1-3-12-9(2)8-10-4-6-11(13)7-5-10/h4-7,9,12-13H,3,8H2,1-2H3
charge 0 multiplicity 1
30 atoms
O  -4.784727 -0.025301 0.568953
N  3.139268 -0.097178 -0.300911
C  1.756809 0.11773 0.199595
C  0.777868 -0.146083 -0.984269
C  -0.688567 -0.134812 -0.584124
C  1.593881 1.543463 0.764514
C  4.216349 -0.083906 0.714893
C  -1.257953 -1.227619 0.118186
C  -1.528535 0.970834 -0.881005
C  5.555483 -0.510245 0.088163
C  -2.612767 -1.222824 0.51583
C  -2.883966 0.995754 -0.493033
C  -3.425096 -0.10454 0.2088
H  1.502464 -0.606975 1.01791
H  1.034553 -1.133532 -1.423477
H  0.979227 0.612881 -1.763262
H  3.18963 -0.960235 -0.863759
H  0.54652 1.721628 1.064482
H  1.879684 2.285298 -0.003745
H  2.230482 1.70308 1.652804
H  4.31491 0.942205 1.115959
H  3.984815 -0.747888 1.587562
H  -0.636897 -2.101321 0.351986
H  -1.114362 1.826412 -1.427675
H  5.503899 -1.545666 -0.301739
H  5.816582 0.158441 -0.751086
H  6.368964 -0.472795 0.834739
H  -3.03255 -2.082758 1.0549
H  -3.530989 1.847113 -0.724437
H  -5.066481 -0.840461 1.053448
