program: Gaussian 09
title: 000129645
version: EM64L-G09RevD.01
frameworkgroup: C1[X(C10H14N2O)]
method: RPBEPBE
basis: SDD
operation: Freq
keyword: #p
keyword: freq=noraman
keyword: PBEPBE/SDD
title: #p freq=noraman PBEPBE/SDD
converged: YES YES NO NO
title: Mulliken charges:
elementType: O N N C C C C C C C C C C H H H H H H H H H H H H H H
charge: -0.229588 -0.240832 -0.381065 -0.568038 -0.369081 0.489414 -0.412475 -0.404020 -0.225868 -0.226546 -0.242327 0.265595 -0.764322 0.197057 0.245024 0.199628 0.246777 0.276065 0.228668 0.240245 0.223947 0.225798 0.281012 0.228052 0.253854 0.206976 0.256049
chargesum: 0.00000
title: Mulliken charges with hydrogens summed into heavy atoms:
elementType: O N N C C C C C C C C C C
charge: -0.229588 0.035233 -0.100053 -0.125957 0.077325 0.489414 -0.183807 -0.163775 -0.001921 -0.000748 -0.014275 0.265595 -0.047443
polarizability: 1.62183784e+02 2.27646421e+00 1.20114510e+02 -1.22955039e+01 -5.65170270e+00 8.78792127e+01
1716.lowfreq: -18.1520 -6.6836 -0.0004 0.0004 0.0006 4.7375 16.0070 26.3660 45.2997
frequency: 15.2881 26.0799 45.2642 52.5893 78.4302 95.8992 121.3103 237.3112 241.4301 286.0690 336.0694 359.8395 403.5952 417.3804 492.1429 534.8053 558.3834 582.4158 617.8462 622.0234 664.6922 705.5059 761.7157 802.4218 813.9682 855.3789 900.1416 918.6254 966.6661 976.8090 990.0679 994.5685 1014.7384 1026.1831 1036.5824 1039.0978 1067.2203 1098.6017 1158.7244 1171.9972 1185.9464 1187.2937 1216.3543 1261.0722 1269.6151 1287.2857 1327.2715 1354.4163 1381.3077 1382.7719 1424.9761 1440.5626 1449.9176 1466.8690 1476.1161 1484.6827 1488.7945 1508.5871 1593.5042 1615.0135 1653.5733 2877.1999 2979.7179 2992.9397 3040.5811 3061.1663 3093.1118 3102.0592 3112.5971 3117.9956 3131.6019 3143.7831 3162.1142 3389.0597 3457.5282
redmass: 3.9093 5.1061 3.5241 3.5730 1.2573 2.5109 2.6548 3.6146 4.0998 3.2903 2.4089 3.0483 2.8188 2.5366 2.5898 2.6009 1.9910 3.0414 6.3631 2.1567 2.6561 1.7569 1.8803 1.2412 3.2807 1.2457 3.9538 1.4355 2.0178 1.3869 6.2833 1.3128 1.6897 2.2753 1.7559 2.7865 2.6907 1.5920 2.7662 1.0562 1.5921 1.1193 2.3511 2.1980 1.2550 1.4507 1.2566 1.3648 1.2326 7.1494 1.2445 2.1716 1.0458 1.0751 1.1294 2.2331 1.1436 1.3516 6.0582 6.1777 7.4345 1.0711 1.0635 1.0364 1.0881 1.0992 1.0997 1.0983 1.0873 1.0868 1.0909 1.0958 1.1015 1.0767 1.0761
irintensity: 1.5057 5.6474 5.3016 3.9411 2.7359 1.5772 1.6815 2.3425 0.6169 7.0209 0.6101 19.3008 0.0269 29.8208 60.0940 10.0932 80.7538 16.1087 0.1091 21.5460 28.2015 50.9476 51.6435 0.7189 3.3943 0.0191 0.3015 2.9716 23.8196 0.0258 0.1844 0.1588 1.8489 3.8389 17.8254 5.3658 5.7355 7.5018 68.3968 0.7807 33.2773 0.5308 1.9090 39.8870 19.6193 9.0732 0.1922 5.1954 49.0103 0.8857 40.7153 4.2300 14.8439 20.4731 6.6977 20.2584 5.6124 53.8554 1.4866 9.8212 205.6297 86.9724 33.5771 13.7312 8.6093 25.8557 22.3759 9.1655 10.6352 5.0614 11.4686 43.7281 22.7392 41.6261 0.6638
temp: 298.150 k
press: 1.00000 atm
elementType: 8 7 7 6 6 6 6 6 6 6 6 6 6 1 1 1 1 1 1 1 1 1 1 1 1 1 1
symmnumber: 1
zpe: 587397.9 jmol-1
zpe.correction: 0.223728 hartree
zpe.thermalcorrener: 0.237303 hartree
zpe.thermalcorrenthalpy: 0.238247 hartree
zpe.thermalcorrgfe: 0.179988 hartree
zpe.sumelectzpe: -573.185535 hartree
zpe.sumelectthermal: -573.171961 hartree
zpe.sumelectthermalent: -573.171016 hartree
zpe.sumelectthermalfe: -573.229275 hartree
dipole: -0.8942 -3.5720 2.9190
dipole: 4.6989
quadrupole: -76.2741 -72.0416 -79.9935
quadrupole: -11.1970 8.6986 2.6786
quadrupole: -0.1710 4.0615 -3.8905 -11.1970 8.6986 2.6786
hfenergy: -573.4092631 hartree
pointgroup: C01 [X(C10H14N2O1)]
dipole: 0.378785 1.5511205 0.9317396 debye
polarizability: 162.5598602|3.631268|120.983229|10.8362079|0.7235797|86.6344182 unknown
InChI: InChI=1S/C10H14N2O/c1-9(13)12-11-8-7-10-5-3-2-4-6-10/h2-6,11-12H,7-8H2,1H3
charge 0 multiplicity 1
27 atoms
O  -3.956028 -1.22719 -0.554658
N  -1.938039 0.78432 -0.659365
N  -3.0488 0.806987 0.198378
C  0.464673 0.410976 -1.109913
C  -0.626969 0.5568 -0.019576
C  1.827803 0.122542 -0.499746
C  2.712732 1.176058 -0.153693
C  2.223817 -1.211863 -0.223192
C  3.960033 0.906054 0.454137
C  3.46954 -1.48718 0.383937
C  4.342287 -0.427905 0.726422
C  -3.991527 -0.232233 0.215141
C  -5.088517 -0.038702 1.266276
H  0.506046 1.343711 -1.708357
H  0.15145 -0.402695 -1.788633
H  -0.334445 1.371696 0.687917
H  -0.692291 -0.378749 0.563978
H  -1.962421 1.53325 -1.361724
H  2.426051 2.213324 -0.369976
H  1.553114 -2.037691 -0.491822
H  4.633367 1.732064 0.710493
H  3.761248 -2.524308 0.585025
H  -3.127067 1.544245 0.913253
H  5.310103 -0.639854 1.194597
H  -5.080503 -0.902603 1.952803
H  -4.985767 0.888571 1.857489
H  -6.068592 -0.030323 0.759608
