program: Gaussian 09
title: 000129656
version: EM64L-G09RevD.01
frameworkgroup: C1[X(C9H10FN3O5)]
method: RPBEPBE
basis: SDD
operation: Freq
keyword: #p
keyword: freq=noraman
keyword: PBEPBE/SDD
title: #p freq=noraman PBEPBE/SDD
converged: YES YES NO NO
title: Mulliken charges:
elementType: F O O O O O N N N C C C C C C C C C H H H H H H H H H H
charge: -0.154702 -0.269511 -0.415752 -0.292811 -0.227615 -0.202650 -0.392038 -0.286828 -0.410411 -0.366307 -0.401847 -0.470641 0.353211 0.260858 -0.145537 0.184538 0.182099 0.122965 0.253511 0.236400 0.219515 0.260475 0.245466 0.262292 0.374867 0.323260 0.377096 0.380097
chargesum: 0.00000
title: Mulliken charges with hydrogens summed into heavy atoms:
elementType: F O O O O O N N N C C C C C C C C C
charge: -0.154702 -0.269511 -0.035655 -0.292811 -0.227615 -0.202650 -0.017171 -0.286828 -0.033315 0.123604 0.078143 0.037118 0.353211 0.260858 0.177723 0.184538 0.182099 0.122965
polarizability: 1.87663270e+02 -1.78722748e+01 1.29123531e+02 2.04687757e+01 1.16319506e+01 9.67417928e+01
1716.lowfreq: -8.9478 -0.0008 -0.0005 -0.0003 1.0001 3.5440 13.2280 14.8945 23.3887
frequency: 13.0471 14.7382 23.3781 57.2579 77.2034 82.3725 115.4672 134.5754 162.4573 188.9594 200.7312 241.4784 270.2613 308.8088 339.8518 369.7703 395.7177 401.7495 408.3555 427.0759 472.0819 494.8855 505.7206 587.3491 591.3715 640.0411 652.4685 675.2621 706.2109 717.4490 726.0964 745.4896 760.7365 779.7431 812.7480 822.6157 858.6574 911.2287 918.0190 924.9890 1011.5529 1042.9686 1075.2104 1092.6689 1106.3764 1133.7372 1175.1016 1194.0252 1207.5825 1240.2582 1256.1579 1276.8989 1282.9938 1303.1737 1330.4404 1359.9959 1364.0159 1380.2069 1383.7393 1441.3131 1458.5898 1466.7393 1521.4197 1616.0681 1643.5965 1669.6564 1674.8228 1707.9664 2987.9290 3012.9612 3016.2661 3040.9015 3075.3049 3086.1972 3184.4938 3301.1718 3514.4880 3515.1141
redmass: 8.8071 12.4993 8.7063 8.1239 10.3800 2.4190 3.4078 5.9262 10.7207 6.4137 4.0265 6.6706 7.8976 9.1993 3.6804 9.8339 12.5662 6.3515 3.9783 4.4319 11.6260 3.3436 1.8219 6.0578 4.7847 1.3262 5.3991 3.5245 3.4926 9.3966 5.9636 5.1560 1.6895 1.9188 1.4684 1.9559 3.4787 3.0933 1.3221 2.2900 3.0406 2.5158 2.8508 3.0954 2.4700 7.2624 1.4164 2.4537 4.1161 1.4405 3.7379 1.1859 1.3346 2.3948 1.4028 1.3392 1.7982 1.8643 4.6416 1.0868 1.0946 1.0896 1.7719 4.7904 9.2429 8.2864 7.6477 7.2966 1.0623 1.0604 1.0625 1.0963 1.1018 1.1044 1.0930 1.0830 1.0770 1.0640
irintensity: 0.3056 1.1529 0.2071 0.1988 3.4179 0.6095 0.0148 0.6329 11.9430 1.0098 4.9360 6.8890 1.1675 4.9094 34.3348 0.1705 18.0821 2.8254 6.6299 24.6756 3.4577 17.5987 22.8197 9.3113 17.2306 125.9427 1.6945 19.0200 0.5541 1.3009 7.0626 21.7831 55.1245 88.4585 111.1198 72.5393 6.5854 21.2641 38.1644 3.4079 92.2987 182.3125 72.3325 24.6027 26.0686 112.4144 41.0296 111.7431 32.5810 8.4294 290.2108 2.2814 20.2728 78.8698 48.7185 14.9593 26.6880 38.2404 44.3002 31.5875 22.1159 24.7056 707.7708 99.0126 146.1416 204.1077 334.7004 415.5181 8.7043 24.7753 20.5829 1.1910 19.9300 22.7988 33.0463 222.7640 69.5682 24.2994
temp: 298.150 k
press: 1.00000 atm
elementType: 9 8 8 8 8 8 7 7 7 6 6 6 6 6 6 6 6 6 1 1 1 1 1 1 1 1 1 1
symmnumber: 1
zpe: 524493.8 jmol-1
zpe.correction: 0.199769 hartree
zpe.thermalcorrener: 0.216839 hartree
zpe.thermalcorrenthalpy: 0.217783 hartree
zpe.thermalcorrgfe: 0.150686 hartree
zpe.sumelectzpe: -987.886548 hartree
zpe.sumelectthermal: -987.869479 hartree
zpe.sumelectthermalent: -987.868535 hartree
zpe.sumelectthermalfe: -987.935631 hartree
dipole: 3.3759 1.3464 2.7111
dipole: 4.5342
quadrupole: -126.5718 -108.9100 -102.0432
quadrupole: 9.9475 -1.7155 -6.2687
quadrupole: -14.0634 3.5983 10.4651 9.9475 -1.7155 -6.2687
hfenergy: -988.0863175 hartree
pointgroup: C01 [X(C9H10F1N3O5)]
dipole: -1.3249385 0.4717537 -1.0974131 debye
polarizability: 187.6930404|18.8717409|127.5988676|19.5466945|-13.4111826|98.2366864 unknown
InChI: InChI=1S/C9H10FN3O5/c10-5-4-13(9(18)12-7(5)16)8(17)11-3-1-2-6(14)15/h4,11-12,14H,1-3H2
charge 0 multiplicity 1
28 atoms
F  4.416625 -0.967313 1.637737
O  -0.052192 -2.303303 0.248504
O  -4.940524 2.118164 0.883859
O  0.668024 1.412374 -1.627513
O  -5.34962 -0.096926 1.449483
O  4.891202 1.567821 0.351959
N  -0.911053 -0.663415 -1.185832
N  1.289017 -0.410801 -0.234748
N  2.755643 1.414091 -0.604843
C  -3.250056 -1.040416 -0.308671
C  -2.202123 -1.349115 -1.401483
C  -3.626887 0.451274 -0.248521
C  0.030995 -1.211894 -0.372851
C  1.511865 0.838879 -0.871605
C  2.271174 -0.981892 0.59103
C  -4.709939 0.737857 0.77447
C  3.469546 -0.369716 0.813798
C  3.823978 0.922475 0.213765
H  -2.866197 -1.376742 0.670915
H  -4.154093 -1.644389 -0.510133
H  -2.575323 -1.039147 -2.394956
H  -2.014481 -2.436516 -1.4267
H  -3.9950 0.811245 -1.230639
H  -2.751233 1.082745 -0.00594
H  -0.690209 0.245837 -1.629368
H  1.994328 -1.943398 1.031574
H  2.92386 2.317181 -1.062542
H  -5.662127 2.27894 1.55115
