program: Gaussian 09
title: 000129647
version: EM64L-G09RevD.01
frameworkgroup: C1[X(C12H19NO2)]
method: RPBEPBE
basis: SDD
operation: Freq
keyword: #p
keyword: freq=noraman
keyword: PBEPBE/SDD
title: #p freq=noraman PBEPBE/SDD
converged: YES YES NO NO
title: Mulliken charges:
elementType: O O N C C C C C C C C C C C C H H H H H H H H H H H H H H H H H H H
charge: -0.328709 -0.432551 -0.302548 -0.026398 -0.622717 0.558736 -0.712632 -0.324574 -0.517106 -0.446605 0.220770 -0.699011 -0.325815 0.120101 -0.523223 0.192500 0.189966 0.233531 0.239935 0.215713 0.235506 0.219865 0.216046 0.173270 0.241803 0.238014 0.200041 0.232701 0.213630 0.248411 0.377441 0.225624 0.225341 0.242945
chargesum: 0.00000
title: Mulliken charges with hydrogens summed into heavy atoms:
elementType: O O N C C C C C C C C C C C C
charge: -0.328709 -0.055109 -0.062613 0.166102 -0.199219 0.558736 -0.041548 0.064742 -0.275304 -0.208592 0.220770 -0.052640 -0.077403 0.120101 0.170687
polarizability: 1.94085003e+02 3.77073934e-01 1.50533832e+02 1.17185813e+01 1.26862875e+00 9.85707018e+01
1716.lowfreq: -4.0656 -0.0009 -0.0007 -0.0004 2.1354 10.5781 30.1660 35.8225 57.4367
frequency: 30.1325 35.6651 57.3688 84.8663 88.6329 100.4278 142.2320 164.9691 184.8568 204.9460 228.1104 252.1223 261.5840 275.1803 306.8591 339.5218 354.5792 361.6545 437.1922 450.4834 475.3666 486.9583 507.7933 535.3005 551.7286 613.3826 661.5704 710.5106 726.7718 779.2165 811.9285 814.8090 833.1546 858.1454 884.5225 900.4842 924.3705 936.9681 962.9495 1009.9178 1052.3659 1061.7020 1094.6267 1116.3902 1116.9316 1125.4427 1144.5966 1153.1377 1158.5689 1182.4035 1188.0838 1212.9068 1223.7035 1254.9832 1268.1733 1284.0059 1311.0298 1323.6167 1342.3177 1359.6075 1381.5622 1390.4119 1413.0223 1421.8539 1447.1187 1457.1447 1464.5205 1465.1870 1469.3799 1473.8952 1475.4449 1482.2152 1484.2343 1500.9125 1505.4261 1610.3484 1621.0293 2824.8324 2845.9596 2951.1566 2963.7042 2976.8951 2983.8262 3014.1866 3042.3438 3052.1829 3069.8371 3080.2223 3090.1964 3091.0569 3125.1476 3134.0913 3137.3227 3170.0186 3406.4316 3515.3418
redmass: 3.3133 3.3769 3.8906 3.0790 1.8149 2.7400 3.9786 3.5178 2.0371 2.0030 1.2497 1.2099 2.1171 2.7638 3.2652 3.9146 2.6754 3.2186 2.8259 2.3980 4.0074 1.1198 3.1675 4.1096 4.6044 3.3729 1.7516 4.3772 3.5504 4.2992 1.3962 1.2514 1.5995 1.9747 1.7633 1.6824 2.7734 1.3735 1.9679 4.3916 2.3681 1.7139 1.8743 1.9227 1.2835 1.6178 1.6205 2.4850 1.7625 2.2514 1.4509 1.6042 1.7083 1.1491 1.7493 1.5499 1.7529 1.3236 1.4447 1.3921 1.2270 1.2447 3.7484 2.3116 1.4613 1.1704 1.0506 1.0958 1.0604 1.0983 1.0959 1.0503 1.0599 1.0898 3.0422 6.5926 6.8607 1.0806 1.0724 1.0661 1.0326 1.0374 1.0357 1.0854 1.0946 1.1042 1.0977 1.0995 1.0994 1.1001 1.0996 1.0900 1.0905 1.0954 1.0737 1.0645
irintensity: 0.3079 0.0257 0.1747 7.4449 0.8854 1.1001 0.7494 1.1428 0.4512 0.3036 0.2705 1.5517 0.0420 3.0700 3.9043 1.9154 2.5128 3.0734 7.3103 5.8801 6.5140 137.1138 4.5408 12.0481 22.6516 47.7807 46.1122 1.4222 4.1020 25.8565 30.1769 15.8434 0.6065 18.9343 7.9886 2.1892 5.1395 0.0776 1.0959 44.9856 2.4588 4.8036 7.0404 38.2886 2.2544 18.7131 11.1208 12.7902 65.0571 139.2825 132.7386 27.6748 5.2581 15.7162 69.6436 41.8641 39.9611 7.8697 30.9423 2.0851 20.5168 16.8805 18.3828 27.0778 18.5097 20.5226 12.7107 10.2653 3.1226 88.9540 14.0044 11.2899 2.5738 9.7310 129.2596 9.4219 14.1401 82.6552 130.4944 47.7040 54.5739 37.8121 16.9148 25.1676 18.7189 44.9570 56.9236 40.3842 29.1966 38.7772 25.2504 10.6696 11.2267 7.5249 4.4240 77.0802
temp: 298.150 k
press: 1.00000 atm
elementType: 8 8 7 6 6 6 6 6 6 6 6 6 6 6 6 1 1 1 1 1 1 1 1 1 1 1 1 1 1 1 1 1 1 1
symmnumber: 1
zpe: 758793.0 jmol-1
zpe.correction: 0.289009 hartree
zpe.thermalcorrener: 0.305704 hartree
zpe.thermalcorrenthalpy: 0.306648 hartree
zpe.thermalcorrgfe: 0.243966 hartree
zpe.sumelectzpe: -672.678605 hartree
zpe.sumelectthermal: -672.661910 hartree
zpe.sumelectthermalent: -672.660966 hartree
zpe.sumelectthermalfe: -672.723648 hartree
dipole: -1.3801 3.9737 -0.1589
dipole: 4.2096
quadrupole: -97.8625 -81.3498 -93.5728
quadrupole: 6.3645 -0.3383 -0.3872
quadrupole: -6.9341 9.5786 -2.6444 6.3645 -0.3383 -0.3872
hfenergy: -672.9676144 hartree
pointgroup: C01[X(C12H19N1O2)]
dipole: 0.5328253 -1.5631122 0.1252363 debye
polarizability: 194.3081924|-1.1645682|149.5513928|-10.7287287|-7.1799761|99.329952 unknown
InChI: InChI=1S/C12H19NO2/c1-4-13-9(2)7-10-5-6-11(14)12(8-10)15-3/h5-6,8-9,13-14H,4,7H2,1-3H3
charge 0 multiplicity 1
34 atoms
O  -3.151741 -1.615766 0.333691
O  -4.339809 0.781825 0.305337
N  3.554683 -0.081036 -0.326163
C  2.179359 0.14374 0.188247
C  1.264096 0.464935 -1.030644
C  -0.21535 0.553878 -0.690198
C  2.162171 1.284808 1.225873
C  4.551059 -0.577589 0.649081
C  -0.941358 -0.622351 -0.350281
C  -0.897179 1.79411 -0.689141
C  -2.30571 -0.539636 -0.020404
C  5.87162 -0.929006 -0.058825
C  -2.271006 1.880131 -0.358105
C  -2.979931 0.71554 -0.021708
C  -2.56564 -2.954076 0.378318
H  1.774736 -0.77774 0.68587
H  1.423449 -0.32735 -1.793872
H  1.617095 1.412902 -1.477211
H  3.535843 -0.686409 -1.161113
H  2.726798 1.017523 2.13682
H  1.125007 1.514549 1.526277
H  2.618596 2.192238 0.78956
H  4.741396 0.214434 1.397423
H  4.18237 -1.47127 1.216458
H  -0.42781 -1.590413 -0.356124
H  -0.350793 2.707061 -0.951159
H  5.727783 -1.742822 -0.796286
H  6.264439 -0.047152 -0.595113
H  6.631042 -1.265815 0.669456
H  -2.801511 2.836886 -0.358421
H  -4.654748 -0.138595 0.509816
H  -1.749809 -3.004439 1.125085
H  -2.17962 -3.251731 -0.615707
H  -3.384626 -3.625464 0.675562
