program: Gaussian 09
title: 000129648
version: EM64L-G09RevD.01
frameworkgroup: C1[X(C15H12O5)]
method: RPBEPBE
basis: SDD
operation: Freq
keyword: #pfreq=noraman
keyword: PBEPBE/SDD
title: #p freq=noraman PBEPBE/SDD
converged: YES YES NO NO
title: Mulliken charges:
elementType: O O O O O C C C C C C C C C C C C C C C H H H H H H H H H H H H
charge: -0.254785 -0.266200 -0.435799 -0.432252 -0.429054 0.055395 -0.242069 0.273860 -0.433578 0.361787 0.216627 0.136792 -0.393205 -0.332098 -0.501130 -0.544620 -0.412531 0.338584 -0.385347 0.322014 0.272705 0.240350 0.257205 0.258690 0.361076 0.251941 0.274679 0.250516 0.220896 0.256324 0.354960 0.358265
chargesum: 0.00000
title: Mulliken charges with hydrogens summed into heavy atoms:
elementType: O O O O O C C C C C C C C C C C C C C C
charge: -0.254785 -0.266200 -0.074723 -0.077292 -0.070788 0.055395 0.030636 0.273860 0.063977 0.361787 0.216627 0.136792 -0.134515 -0.080157 -0.226451 -0.294104 -0.191634 0.338584 -0.129023 0.322014
polarizability: 2.80083384e+02 -4.75097104e+00 1.63800949e+02 2.00327280e+00 -9.22157967e+00 9.77370375e+01
1716.lowfreq: -2.9109 -0.0003 0.0002 0.0006 4.5896 10.0289 38.1516 58.0825 83.6584
frequency: 38.1130 58.0747 83.6572 120.1609 147.5803 193.3919 207.5897 236.6748 247.9495 259.0025 285.6554 321.0976 332.1378 362.3388 371.7270 382.8424 406.1310 417.0023 432.5779 442.3901 454.4698 482.8044 498.0080 532.6619 560.5557 584.4835 606.2050 615.9730 620.3694 641.9128 703.8717 719.3998 730.7325 744.8629 786.2336 796.3013 806.8144 834.4849 840.8860 854.0912 865.4072 898.7966 919.4377 928.9147 936.5187 939.1014 958.1718 989.4890 1069.1582 1080.6524 1096.6046 1122.6802 1130.1491 1143.9469 1155.5255 1162.4612 1179.8963 1208.7312 1226.6685 1237.3614 1246.9641 1268.5202 1277.3337 1293.1413 1320.7741 1333.7041 1368.0837 1398.2700 1404.5120 1433.5258 1444.0182 1448.8182 1498.0542 1500.2048 1594.4846 1608.1998 1631.2257 1636.5197 3006.7618 3010.3635 3115.2465 3125.8957 3143.3274 3144.8542 3160.6905 3182.6399 3192.2393 3516.0620 3580.9543 3584.4189
redmass: 6.9046 5.2045 6.2467 5.2516 4.9378 6.5535 5.6474 6.9647 6.3284 6.6733 4.9670 5.8420 3.8626 1.1198 1.1434 3.5108 3.7804 1.1981 4.5252 3.2738 3.4504 4.4059 6.9931 6.5374 4.9092 5.6045 6.1724 3.6624 4.6479 6.3506 3.4912 6.7973 4.3475 7.6659 1.4477 2.6994 2.2330 2.9110 1.6916 1.6049 5.5912 5.7224 3.1139 1.4755 2.9988 2.7763 1.3696 4.4785 2.7244 2.1841 2.5553 1.8508 1.5288 1.9956 1.4525 1.4427 1.5790 1.5615 1.5239 1.6707 1.7064 1.4794 2.0486 2.2524 1.5468 1.8148 1.7518 6.6109 4.8137 1.9969 3.9884 1.4815 3.2954 3.4597 6.8751 8.1568 7.2885 7.6655 1.0849 1.0634 1.1033 1.0891 1.0914 1.0909 1.0957 1.0958 1.0935 1.0655 1.0661 1.0660
irintensity: 1.3179 0.0629 1.9508 0.5309 2.1161 8.1528 5.9222 1.5244 2.5980 1.4185 10.4500 2.4905 0.6665 134.9657 146.9828 0.2749 8.1458 86.6720 9.2282 0.4425 37.3633 24.4505 4.6811 20.6625 0.6905 5.1984 10.3648 24.1629 9.3934 8.3234 10.1592 9.2235 1.5501 5.9683 41.7127 13.7125 4.7276 17.1587 67.2877 42.0862 74.6146 9.3049 67.6642 22.3702 73.0929 62.4648 2.2280 116.0592 48.7451 300.0255 185.2263 22.9808 196.5051 76.2090 7.9834 14.5586 76.6138 4.3169 15.0636 63.7902 6.1698 14.1300 0.9551 27.2365 49.9921 28.8808 21.6257 10.8245 123.6636 13.5443 47.8067 17.1909 95.7584 37.2680 48.1400 50.5285 297.1121 105.9069 10.2471 31.1707 10.4108 14.9897 8.8060 0.6175 7.6157 4.2823 0.1242 6.6788 53.8802 47.6603
temp: 298.150 k
press: 1.00000 atm
elementType: 8 8 8 8 8 6 6 6 6 6 6 6 6 6 6 6 6 6 6 6 1 1 1 1 1 1 1 1 1 1 1 1
symmnumber: 1
zpe: 624933.3 jmol-1
zpe.correction: 0.238025 hartree
zpe.thermalcorrener: 0.254103 hartree
zpe.thermalcorrenthalpy: 0.255048 hartree
zpe.thermalcorrgfe: 0.195266 hartree
zpe.sumelectzpe: -953.474847 hartree
zpe.sumelectthermal: -953.458768 hartree
zpe.sumelectthermalent: -953.457824 hartree
zpe.sumelectthermalfe: -953.517606 hartree
dipole: -0.0971 2.8054 -1.2395
dipole: 3.0686
quadrupole: -92.6366 -115.5388 -117.4237
quadrupole: -0.4661 -0.2315 -6.5068
quadrupole: 15.8964 -7.0058 -8.8907 -0.4661 -0.2315 -6.5068
hfenergy: -953.7128716 hartree
pointgroup: C01 [X(C15H12O5)]
dipole: 0.0407649 1.1055271 0.4833673 debye
polarizability: 280.1002888|4.2206541|163.8358895|2.838981|8.9641377|97.6851929 unknown
InChI: InChI=1S/C15H12O5/c16-8-1-3-10-12(5-8)19-7-15(18)11-4-2-9(17)6-13(11)20-14(10)15/h1-6,14,16-18H,7H2
charge 0 multiplicity 1
32 atoms
O  0.664856 -1.357293 -0.167988
O  -1.57061 1.858776 0.68831
O  0.394719 2.073174 -1.499796
O  5.465155 -1.471263 0.676116
O  -5.769825 -0.600897 0.529471
C  0.502875 1.079806 -0.429075
C  -0.197124 -0.268416 -0.807773
C  1.931299 0.630642 -0.213159
C  -0.114803 1.628385 0.87363
C  -1.631681 -0.381171 -0.373456
C  1.941924 -0.774109 -0.02855
C  -2.269964 0.687308 0.310745
C  3.12282 1.35984 -0.09984
C  -2.42129 -1.508007 -0.720094
C  3.107612 -1.490649 0.268545
C  -3.646539 0.6550 0.618355
C  4.325465 0.670373 0.192214
C  4.302749 -0.737314 0.379604
C  -3.78794 -1.577462 -0.406663
C  -4.39852 -0.482916 0.256212
H  -0.08467 -0.40811 -1.900779
H  0.03626 0.9148 1.705535
H  0.303018 2.614852 1.126077
H  3.127997 2.442679 -0.258403
H  -0.506188 2.489512 -1.440448
H  -1.943716 -2.343429 -1.243799
H  3.118384 -2.573943 0.403854
H  -4.092216 1.506829 1.144365
H  5.271181 1.220969 0.2684
H  -4.396551 -2.447147 -0.666539
H  6.252733 -0.87478 0.726764
H  -6.112311 0.204463 0.991067
