program: Gaussian 09
title: 000129651
version: EM64L-G09RevD.01
frameworkgroup: C1[X(C11H13BrN2O)]
method: RPBEPBE
basis: SDD
operation: Freq
keyword: #p
keyword: freq=noraman
keyword: PBEPBE/SDD
title: #p freq=noraman PBEPBE/SDD
converged: YES YES NO NO
title: Mulliken charges:
elementType: Br O N N C C C C C C C C C C C H H H H H H H H H H H H H
charge: 0.008032 -0.249252 -0.227436 -0.022279 -0.368559 -0.393600 -0.414571 -0.482133 0.305336 0.070024 0.225193 -0.299517 -0.166059 -0.365141 -0.802338 0.226367 0.211460 0.217386 0.205303 0.260704 0.217016 0.228336 0.240510 0.268240 0.234000 0.244951 0.308234 0.319794
chargesum: 0.00000
title: Mulliken charges with hydrogens summed into heavy atoms:
elementType: Br O N N C C C C C C C C C C C
charge: 0.008032 -0.249252 -0.227436 -0.022279 0.069268 0.029088 0.063148 -0.013287 0.305336 0.070024 0.225193 -0.031277 0.067942 -0.120189 -0.174310
polarizability: 1.38887597e+02 2.04182904e+01 1.53369605e+02 7.96811799e+00 -2.64145043e+00 1.38226844e+02
1716.lowfreq: -12.0346 -0.6218 -0.0006 -0.0006 -0.0005 10.4520 23.7070 52.8990 66.9174
frequency: 23.6187 52.8172 66.8502 91.9532 104.1299 147.7369 182.4074 240.3011 285.0304 300.2299 327.4515 363.1382 388.5365 419.9942 452.2211 475.2894 496.6442 550.7215 564.6693 589.5096 618.7709 672.2106 721.7036 766.1020 785.1459 811.8397 816.0004 834.3831 878.5036 881.3589 920.0284 937.9794 964.7695 977.0060 979.8280 1029.5216 1056.5383 1071.7136 1098.6542 1108.0570 1120.3537 1162.7545 1171.5910 1226.2399 1228.0244 1240.3991 1256.4217 1260.5143 1292.3728 1316.0289 1327.7135 1345.2691 1349.1286 1361.7153 1373.5027 1427.5353 1432.7275 1440.4343 1452.8904 1454.1884 1461.5404 1470.0665 1551.2868 1572.1162 1584.1897 2976.7315 2980.0288 2986.7560 3009.3388 3035.8614 3050.3484 3072.1675 3082.8948 3085.6744 3130.7656 3137.1192 3167.7905 3175.1526
redmass: 8.5800 8.9240 5.6293 3.8842 3.7070 8.0912 2.9330 2.7423 2.8912 4.1171 3.2580 3.1083 3.5933 3.4206 1.9991 5.3557 4.4046 2.6439 4.2960 4.1800 5.2113 4.3123 6.6607 3.0550 2.7130 1.6560 1.9479 2.4419 1.6723 2.0158 2.8049 1.4215 3.0652 2.1646 1.4517 2.6461 1.9976 2.0175 1.7080 1.9043 1.5181 1.3020 1.5084 1.1951 1.5774 1.5287 1.6469 1.5938 2.2972 3.8399 1.4633 1.7407 1.3722 1.5159 1.7153 1.8178 1.1790 3.1201 1.1329 1.1141 1.0991 1.1100 6.2961 7.1003 6.8879 1.0646 1.0616 1.0623 1.0637 1.0994 1.1001 1.0957 1.0575 1.1018 1.0875 1.0925 1.0999 1.1108
irintensity: 0.4099 1.1605 2.8939 4.3590 0.2885 1.5018 0.0860 1.0186 5.4432 4.2295 1.3954 5.4005 7.2785 7.4000 1.5829 4.3452 7.1600 14.6139 2.3225 5.4095 12.6585 4.8779 1.5200 11.4594 16.6118 29.3382 3.2732 1.6662 3.4921 2.6265 5.8821 0.6639 4.2533 21.8415 1.4335 2.3063 14.9618 9.8421 11.6287 5.9976 30.9029 2.0122 11.5526 8.2484 8.6491 1.1854 23.7701 11.5041 77.5322 4.7429 2.3909 16.6926 0.7797 20.8488 28.9424 0.8460 34.7470 115.4161 48.5189 0.2735 12.0781 16.0576 9.5481 129.2819 183.1083 19.0047 17.0070 37.9695 21.9136 38.1364 58.0257 15.0957 8.3353 4.1310 1.0253 21.4611 21.6832 1.6929
temp: 298.150 k
press: 1.00000 atm
elementType: 35 8 7 7 6 6 6 6 6 6 6 6 6 6 6 1 1 1 1 1 1 1 1 1 1 1 1 1
symmnumber: 1
zpe: 585111.5 jmol-1
zpe.correction: 0.222857 hartree
zpe.thermalcorrener: 0.236391 hartree
zpe.thermalcorrenthalpy: 0.237335 hartree
zpe.thermalcorrgfe: 0.180644 hartree
zpe.sumelectzpe: -624.053531 hartree
zpe.sumelectthermal: -624.039997 hartree
zpe.sumelectthermalent: -624.039053 hartree
zpe.sumelectthermalfe: -624.095744 hartree
dipole: -2.6883 -1.0154 1.9879
dipole: 3.4943
quadrupole: -104.6384 -95.2860 -94.4759
quadrupole: -6.3287 -4.4819 -10.9581
quadrupole: -6.5050 2.8474 3.6575 -6.3287 -4.4819 -10.9581
hfenergy: -624.2763883 hartree
pointgroup: C01 [X(C11H13Br1N2O1)]
dipole: -0.8999787 0.4088446 -0.9554193 debye
polarizability: 157.16829|-15.4802486|144.6718103|-8.777733|-6.2836293|128.6439454 unknown
InChI: InChI=1S/C11H13BrN2O/c12-8-11(15)14-7-2-1-4-9-10(14)5-3-6-13-9/h3,5-6H,1-2,4,7-8H2
charge 0 multiplicity 1
28 atoms
Br 1.840734 1.158939 2.373257
O  3.045713 -0.506324 -0.741172
N  0.722339 -0.307127 -0.673409
N  -2.602582 0.502382 0.848866
C  0.347537 -2.781926 -0.29754
C  -0.988654 -2.688366 0.473916
C  0.574865 -1.644315 -1.317864
C  -1.140319 -1.411291 1.348126
C  -0.487348 0.410312 -0.357484
C  -1.416815 -0.130767 0.582316
C  2.014099 0.144122 -0.387658
C  -0.802679 1.614944 -1.027739
C  -2.016045 2.271652 -0.732087
C  -2.883065 1.674632 0.210101
C  2.170091 1.450212 0.38848
H  1.195301 -2.788796 0.414731
H  0.38717 -3.742074 -0.84916
H  -1.067068 -3.566763 1.142906
H  -1.840363 -2.754013 -0.232678
H  1.505186 -1.82818 -1.881027
H  -0.270475 -1.585178 -2.027966
H  -0.215882 -1.28058 1.94749
H  -1.979821 -1.540596 2.05208
H  -0.113766 2.01173 -1.782491
H  -2.291197 3.207174 -1.22863
H  -3.841032 2.14034 0.468105
H  1.474679 2.250909 0.105939
H  3.216998 1.771449 0.318592
