program: Gaussian 09
title: 000129623
version: EM64L-G09RevD.01
frameworkgroup: C1[X(C14H22N4O2)]
method: RPBEPBE
basis: SDD
operation: Freq
keyword: #p
keyword: freq=noraman
keyword: PBEPBE/SDD
title: #p freq=noraman PBEPBE/SDD
converged: YES YES NO NO
title: Mulliken charges:
elementType: O O N N N N C C C C C C C C C C C C C C H H H H H H H H H H H H H H H H H H H H H H
charge: -0.293191 -0.276718 -0.463048 -0.177133 -0.307802 -0.170773 -0.375135 -0.340268 0.147075 0.364214 0.340616 -0.258569 -0.685497 -0.414300 -0.422094 -0.233677 -0.826743 -0.834911 0.149699 -0.090139 0.206478 0.192172 0.220994 0.187776 0.196368 0.227948 0.216721 0.210421 0.205322 0.231558 0.231140 0.224001 0.223053 0.214893 0.288346 0.224471 0.244963 0.233510 0.328682 0.296106 0.308270 0.255200
chargesum: 0.00000
title: Mulliken charges with hydrogens summed into heavy atoms:
elementType: O O N N N N C C C C C C C C C C C C C C
charge: -0.293191 -0.276718 -0.134366 0.118973 0.000467 -0.170773 0.023515 0.068503 0.147075 0.364214 0.340616 0.165747 -0.053033 -0.182742 -0.190953 -0.009676 -0.100451 -0.131968 0.149699 0.165061
polarizability: 2.83366289e+02 -1.86613074e+01 2.12538972e+02 -4.41513031e+00 -5.28767281e+00 1.21201077e+02
1716.lowfreq: -8.0152 -2.9998 -0.0006 0.0004 0.0008 5.0940 9.7594 14.3340 25.8260
frequency: 3.8736 13.7100 25.7864 43.0127 57.4795 64.2401 70.5239 93.5534 101.2625 118.9375 161.9038 164.8753 183.4678 190.3878 221.2237 230.1177 238.9084 247.3532 265.7228 291.9643 301.1145 306.5753 329.0765 337.5548 356.3574 466.7112 477.7675 514.4618 516.8444 523.1567 535.4065 550.9668 594.9417 624.0077 651.0178 688.6821 710.2721 723.8171 734.2876 743.5835 777.0885 797.0556 812.5518 827.0373 842.5594 889.0531 897.9165 913.8632 931.4995 956.6001 973.6302 987.1312 994.0719 997.1782 1025.0895 1041.0451 1045.8342 1054.1404 1055.9740 1073.3426 1096.9444 1125.6168 1136.1455 1151.0211 1176.8267 1200.5618 1229.1592 1236.2867 1255.6280 1262.3310 1277.8441 1286.0128 1299.3078 1337.4612 1353.7547 1357.3042 1370.2030 1382.0683 1389.4305 1398.5722 1400.0516 1433.1680 1449.5542 1453.4761 1455.7619 1469.7609 1473.8302 1475.1491 1478.5012 1486.3107 1486.6783 1488.7585 1491.9812 1521.4280 1602.3523 1602.6988 1616.1568 1643.1610 2962.1188 2970.0313 2972.4346 2977.9940 2978.1214 2982.5047 3015.2770 3021.4317 3040.1742 3042.6047 3053.4511 3059.9989 3071.4107 3072.2549 3086.0755 3087.9957 3120.5794 3130.7498 3156.1804 3358.8207 3441.7258 3517.9697
redmass: 3.2772 4.1586 3.4688 4.3264 4.3340 3.1145 2.7133 4.1468 3.5770 4.1521 1.4353 1.6039 4.5308 1.4442 2.1022 1.9704 1.5047 2.6389 3.3714 3.7091 3.1431 4.7106 3.7564 3.8277 3.7239 3.1762 3.3044 4.1868 3.3233 1.9753 4.7850 3.9136 4.5629 1.7755 1.3327 4.7778 3.2347 2.2420 3.0521 3.0345 1.2375 2.6814 2.6110 1.9611 4.7609 3.6474 1.3110 1.9811 2.7307 1.2474 1.3468 1.8028 2.4335 2.0428 2.9464 1.6481 1.7032 1.5906 1.7955 2.3417 1.7040 2.1061 1.8335 2.6222 1.1684 1.2687 3.0036 1.3560 1.9030 1.7440 2.4666 1.1657 1.2487 1.4157 1.2908 1.6250 6.5284 1.1299 1.2151 1.2665 1.2406 1.9783 1.0803 1.7105 1.2045 1.1075 1.6664 1.0561 1.0427 1.0888 1.2565 1.0974 1.4069 1.5063 5.5024 7.1552 7.7784 6.0891 1.0415 1.0455 1.0498 1.0632 1.0366 1.0604 1.0883 1.0946 1.0928 1.1008 1.1068 1.0968 1.1014 1.0991 1.1000 1.0983 1.0856 1.0918 1.0995 1.0754 1.0774 1.0754
irintensity: 0.0929 0.5972 0.0092 2.3295 1.2019 3.8973 0.1171 0.6109 2.5417 8.6597 2.5444 5.3471 4.1202 5.3360 3.0201 0.2643 1.3435 1.6403 4.0666 13.1541 2.5116 8.4022 16.2887 9.1715 6.4189 0.9393 15.1606 0.5651 1.0363 27.0428 11.6724 4.0256 7.8004 168.7720 68.2093 7.1566 48.8495 6.1901 41.7888 52.2580 62.6713 34.6533 33.2923 3.6686 1.2679 9.4554 0.1612 25.8212 2.0135 7.6984 0.5418 34.9277 10.6560 40.7838 5.4337 6.5195 6.5385 13.1055 64.8482 41.6696 4.1406 8.4110 64.4219 235.0669 1.7326 0.8130 66.8793 1.5966 6.5985 4.7851 25.6999 0.3995 2.3891 45.3389 7.7130 0.5725 57.7846 50.4202 10.2105 24.2079 15.8009 108.5050 5.9566 76.5834 30.9875 22.7083 356.7217 6.3003 11.6225 24.5882 29.3400 19.0653 152.0406 16.8824 53.8128 17.0595 152.3393 472.7124 33.0985 18.2589 26.6518 43.1107 30.2852 24.5296 19.3543 8.5750 19.8988 9.5063 37.3923 10.0924 94.2031 55.8506 23.9815 23.3653 0.6125 26.8630 39.3598 0.3841 36.2956 22.4446
temp: 298.150 k
press: 1.00000 atm
elementType: 8 8 7 7 7 7 6 6 6 6 6 6 6 6 6 6 6 6 6 6 1 1 1 1 1 1 1 1 1 1 1 1 1 1 1 1 1 1 1 1 1 1
symmnumber: 1
zpe: 914178.6 jmol-1
zpe.correction: 0.348192 hartree
zpe.thermalcorrener: 0.370301 hartree
zpe.thermalcorrenthalpy: 0.371245 hartree
zpe.thermalcorrgfe: 0.292207 hartree
zpe.sumelectzpe: -914.546625 hartree
zpe.sumelectthermal: -914.524516 hartree
zpe.sumelectthermalent: -914.523572 hartree
zpe.sumelectthermalfe: -914.602610 hartree
dipole: 3.1794 -0.0377 -1.0813
dipole: 3.3584
quadrupole: -112.4644 -103.2761 -125.3539
quadrupole: -11.2697 3.5617 0.0059
quadrupole: 1.2338 10.4220 -11.6557 -11.2697 3.5617 0.0059
hfenergy: -914.8948169 hartree
pointgroup: C01 [X(C14H22N4O2)]
dipole: 1.2602733 -0.0172199 0.3965523 debye
polarizability: 284.2790572|16.9195491|211.8440738|0.7367768|-4.8634119|120.9832066 unknown
InChI: InChI=1S/C14H22N4O2/c1-4-5-9-20-18-16-10-15-14(19)17-13-11(2)7-6-8-12(13)3/h6-8,10,16-18H,4-5,9H2,1-3H3
charge 0 multiplicity 1
42 atoms
O  4.306436 0.968605 0.160093
O  -1.254123 1.916058 -1.213688
N  -1.307751 0.262587 0.473002
N  3.40063 1.966005 0.86768
N  2.655783 2.687339 -0.096364
N  0.659435 1.412841 0.183875
C  4.682349 -1.365139 -0.362155
C  6.136403 -1.408861 0.162068
C  -2.629096 -0.269066 0.31327
C  -3.775244 0.579222 0.343093
C  -2.754474 -1.685653 0.178618
C  3.770547 -0.399694 0.403595
C  7.017721 -2.399582 -0.627832
C  -5.049701 -0.022802 0.188436
C  -4.046431 -2.243816 0.046674
C  -5.191827 -1.417804 0.03889
C  -3.663985 2.071924 0.571681
C  -1.522882 -2.574733 0.161755
C  -0.704495 1.264609 -0.274811
C  1.34586 2.362678 -0.400407
H  4.678232 -1.089955 -1.435561
H  4.233066 -2.377522 -0.293182
H  6.569157 -0.392186 0.109067
H  6.126622 -1.691357 1.23479
H  3.783885 -0.600287 1.493124
H  2.724599 -0.441349 0.047102
H  8.052764 -2.417148 -0.240056
H  7.063153 -2.12242 -1.698089
H  6.615755 -3.428942 -0.565486
H  -5.938991 0.61815 0.20409
H  -4.150748 -3.329585 -0.063706
H  -6.187875 -1.86012 -0.073689
H  -2.951854 2.299846 1.386867
H  -4.645208 2.501949 0.83572
H  -3.278715 2.578175 -0.33193
H  -1.011156 -2.600756 1.14541
H  -0.781844 -2.223714 -0.580347
H  -1.795047 -3.613614 -0.089191
H  -0.657613 -0.211054 1.106477
H  4.100785 2.618707 1.266561
H  3.14967 3.293658 -0.763352
H  0.916408 3.000207 -1.19639
