program: Gaussian 09
title: 000129638
version: EM64L-G09RevD.01
frameworkgroup: C1[X(C11H14N4O4)]
method: RPBEPBE
basis: SDD
operation: Freq
keyword: #p
keyword: freq=noraman
keyword: PBEPBE/SDD
title: #p freq=noraman PBEPBE/SDD
converged: YES YES NO NO
title: Mulliken charges:
elementType: O O O O N N N N C C C C C C C C C C C H H H H H H H H H H H H H H
charge: -0.323619 -0.444593 -0.426430 -0.203220 -0.205782 -0.035730 -0.378843 0.019232 -0.105249 -0.516885 -0.124400 -0.068481 -0.337540 0.331530 -0.216379 -0.044440 0.148081 -0.576853 -0.276196 0.287415 0.251799 0.273421 0.232099 0.267376 0.197313 0.219722 0.286287 0.352892 0.345070 0.350417 0.230938 0.265973 0.225075
chargesum: 0.00000
title: Mulliken charges with hydrogens summed into heavy atoms:
elementType: O O O O N N N N C C C C C C C C C C C
charge: -0.323619 -0.091701 -0.076013 -0.203220 -0.205782 -0.035730 -0.033773 0.019232 0.182166 0.008335 0.107699 0.198895 0.079495 0.331530 0.069908 -0.044440 0.148081 -0.079942 -0.051121
polarizability: 2.07322747e+02 1.63284808e+00 1.61339551e+02 -1.12758481e+01 4.38099538e+00 1.04420283e+02
1716.lowfreq: -9.1765 -4.3818 -0.0005 0.0001 0.0004 6.1379 24.5761 33.0793 58.1025
frequency: 23.5845 32.9484 58.0630 78.3105 89.6157 95.7237 118.7270 129.5174 172.1408 208.9427 254.6220 259.7511 276.8364 292.0967 301.4007 340.0186 344.9423 402.7085 414.5008 425.4763 452.8790 502.7247 516.3576 538.7883 558.7371 614.2072 632.4242 650.6830 674.2917 702.9263 712.1431 735.8230 759.5764 769.9851 793.0472 831.9249 852.2762 885.3721 901.3548 928.3648 945.5533 951.5972 964.0170 984.6281 1000.9169 1020.0247 1047.7255 1052.2565 1060.3371 1077.8677 1079.5984 1151.2245 1159.4267 1168.1598 1182.8144 1207.8043 1223.8744 1237.8560 1254.5999 1271.1983 1280.6561 1311.5757 1317.2947 1319.4730 1337.3635 1339.2220 1360.6107 1373.0592 1374.8501 1386.7081 1400.1214 1445.7450 1454.5017 1454.8673 1459.2352 1532.5769 1558.8716 1600.9097 1667.8639 2953.3078 2955.8780 2978.7405 3025.6064 3035.5758 3054.7719 3071.9651 3081.2489 3094.3296 3123.2531 3265.5097 3431.9595 3558.7248 3573.9684
redmass: 6.6524 5.7920 5.3750 3.3910 5.3081 3.8756 6.7233 4.9883 4.1680 5.9291 1.5383 3.2106 2.6954 4.2177 6.9885 3.4514 7.5177 3.9850 1.4369 3.3161 2.6721 3.9539 3.1607 4.8518 4.4675 6.3653 4.1245 3.8521 1.6153 4.0882 4.7776 5.7976 1.5980 3.4716 4.3261 4.7186 3.0641 1.6386 4.0545 3.5667 2.7608 3.0940 2.8388 2.9307 2.9641 3.0991 3.3727 3.2542 3.3687 2.3819 2.4937 1.7485 1.7689 1.5409 1.2553 1.2514 1.9142 2.4248 1.2855 1.4530 1.4600 1.5349 1.3704 1.3399 2.1623 1.2675 1.4165 1.6183 1.7413 1.3038 1.4166 4.5667 1.0913 1.0980 1.0969 2.4015 5.8185 9.2476 6.7388 1.0682 1.0674 1.0857 1.0858 1.0833 1.0686 1.0958 1.0931 1.0902 1.1022 1.0987 1.0774 1.0657 1.0666
irintensity: 3.1636 0.5182 1.4580 3.3004 5.7316 1.7792 2.1276 3.1494 0.2661 1.5797 86.9533 54.8741 44.2911 0.7973 2.9813 1.8878 3.9928 7.0726 195.6895 25.5407 16.8196 12.2088 12.5577 15.5427 2.7689 1.3170 10.6756 62.6568 66.7888 6.7984 19.2773 20.7762 10.2553 23.1339 30.6082 69.3443 10.2492 7.3603 135.7807 0.2936 45.5073 9.7167 55.5966 54.4622 25.9936 27.7445 4.8629 27.8841 13.3245 38.9414 44.6865 31.6450 28.8266 22.6583 36.1645 0.6169 127.3898 1.4152 18.8379 6.2123 2.2687 33.5024 4.3103 10.0247 33.5915 11.8006 3.8906 8.6774 3.4558 19.9752 14.0922 5.3341 1.5786 9.5909 31.5810 352.6428 49.8481 293.0111 167.6771 41.3368 30.8340 58.5171 17.4519 8.2711 24.2594 27.5885 19.5107 23.3815 5.0698 1.4433 120.5260 7.3763 11.1025
temp: 298.150 k
press: 1.00000 atm
elementType: 8 8 8 8 7 7 7 7 6 6 6 6 6 6 6 6 6 6 6 1 1 1 1 1 1 1 1 1 1 1 1 1 1
symmnumber: 1
zpe: 667250.9 jmol-1
zpe.correction: 0.254142 hartree
zpe.thermalcorrener: 0.271417 hartree
zpe.thermalcorrenthalpy: 0.272361 hartree
zpe.thermalcorrgfe: 0.207745 hartree
zpe.sumelectzpe: -945.992078 hartree
zpe.sumelectthermal: -945.974804 hartree
zpe.sumelectthermalent: -945.973859 hartree
zpe.sumelectthermalfe: -946.038475 hartree
dipole: -10.4379 0.9979 4.0735
dipole: 11.2490
quadrupole: -128.4040 -124.6410 -106.0121
quadrupole: 18.9114 8.1090 1.0995
quadrupole: -8.7183 -4.9553 13.6736 18.9114 8.1090 1.0995
hfenergy: -946.2462203 hartree
pointgroup: C01 [X(C11H14N4O4)]
dipole: 3.9505758 1.5060082 -1.3082932 debye
polarizability: 205.2009756|9.9377644|151.2333324|-15.5198818|21.79155|116.6482735 unknown
InChI: InChI=1S/C11H14N4O4/c16-3-8-6(17)1-9(19-8)15-5-14-10-7(18)2-12-4-13-11(10)15/h4-6,8-9,13,16-17H,1-3H2
charge 0 multiplicity 1
33 atoms
O  1.828482 1.139778 -0.091072
O  2.764672 -2.088935 -0.523826
O  3.761452 2.177796 1.734738
O  -4.131709 -1.817647 0.255982
N  0.094026 -0.306812 -0.980863
N  -1.438252 -1.990861 -0.987608
N  -1.032612 1.428986 0.297445
N  -3.331112 1.56967 1.185867
C  1.246995 0.544126 -1.318228
C  2.431504 -0.186782 -1.969531
C  3.252466 -0.729438 -0.778584
C  2.955309 0.262726 0.383557
C  4.124951 1.1977 0.715108
C  -1.049065 0.183335 -0.328236
C  -0.207594 -1.642365 -1.353319
C  -2.001844 -0.858923 -0.343046
C  -3.402313 -0.799154 0.099144
C  -4.012991 0.619997 0.279002
C  -2.082639 1.913177 1.118642
H  0.886575 1.407852 -1.904621
H  3.022089 0.556285 -2.530504
H  2.149735 -0.997801 -2.656877
H  4.336412 -0.752379 -1.014477
H  2.606154 -0.265712 1.290706
H  4.478158 1.694257 -0.214976
H  4.959738 0.622364 1.151741
H  0.517689 -2.289595 -1.834632
H  3.202675 -2.471508 0.27741
H  -0.096904 1.821976 0.465696
H  2.982271 2.691356 1.39997
H  -4.096764 1.073688 -0.732159
H  -5.034236 0.466803 0.662591
H  -1.73642 2.70594 1.79766
