program: Gaussian 09
title: 000129580
version: EM64L-G09RevD.01
frameworkgroup: C1[X(C12H9FN2O5)]
method: RPBEPBE
basis: SDD
operation: Freq
keyword: #p
keyword: freq=noraman
keyword: PBEPBE/SDD
title: #p freq=noraman PBEPBE/SDD
converged: YES YES NO NO
title: Mulliken charges:
elementType: F O O O O O N N C C C C C C C C C C C C H H H H H H H H H
charge: -0.162083 -0.262747 -0.229301 -0.215133 -0.380697 -0.241160 -0.298882 -0.405042 0.362537 0.222554 0.241428 -0.357864 -0.806845 0.187727 -0.227030 -0.368772 -0.207109 0.202758 0.108459 0.232962 0.259888 0.295741 0.249055 0.259563 0.265166 0.264013 0.243699 0.370155 0.396961
chargesum: 0.00000
title: Mulliken charges with hydrogens summed into heavy atoms:
elementType: F O O O O O N N C C C C C C C C C C C C
charge: -0.162083 -0.262747 -0.229301 -0.215133 0.016264 -0.241160 -0.298882 -0.034887 0.362537 0.222554 0.241428 -0.097976 -0.033061 0.187727 0.068711 -0.104760 0.036590 0.202758 0.108459 0.232962
polarizability: 2.23602423e+02 -1.46780617e+01 1.37356123e+02 -4.26361531e+00 -6.72173204e+00 1.21268712e+02
1716.lowfreq: -7.7563 -4.6987 -2.5589 -0.0008 -0.0008 -0.0006 4.7872 23.8717 40.9295
frequency: -6.1928 23.6170 40.9141 48.7759 69.7940 81.6238 98.1072 119.7622 165.9875 170.4417 222.8176 252.9445 274.7033 286.6047 313.6580 328.1145 353.5677 365.9305 374.7617 414.3003 453.9171 505.5697 518.9343 527.0329 530.6149 556.3700 559.7953 614.0408 645.7565 678.5718 688.1751 689.4204 712.0894 718.9412 728.4409 769.8763 774.5420 798.9478 807.4851 842.3238 877.8802 913.4883 930.3537 976.3371 979.9925 1046.5083 1067.7289 1070.1707 1082.9230 1131.8964 1168.8626 1173.1758 1195.8490 1230.6900 1237.5601 1280.8456 1323.2784 1328.0055 1370.4206 1373.7027 1387.3993 1399.4788 1439.8171 1463.7771 1468.6717 1493.2548 1586.8770 1616.7958 1628.8125 1649.7275 1654.8912 1669.3829 2997.3699 3086.2508 3112.1278 3149.1607 3164.1061 3181.8172 3193.2821 3519.5028 3570.0972
redmass: 2.0130 5.0333 8.8866 9.1851 7.3112 2.4618 5.5600 6.8328 5.7508 4.9161 7.8526 4.6886 6.0433 11.2011 4.2859 4.9491 6.9224 6.5463 8.2205 4.3830 11.1038 3.4542 5.3114 1.2845 3.1006 5.8496 7.5928 6.6090 5.8978 6.9172 10.2812 2.2853 9.4755 2.4186 5.9471 5.2890 2.2627 1.8740 4.9867 3.7349 1.3640 1.6031 4.0712 1.7694 1.5150 1.5254 2.4474 1.9994 2.5369 7.4051 1.4820 3.7160 3.7179 2.0847 3.0172 1.8575 2.0830 3.6344 1.6826 6.4877 6.4462 1.2335 1.8092 1.4052 3.1524 1.0859 6.6905 7.9515 6.3440 11.9565 10.7537 6.4116 1.0393 1.0952 1.0992 1.0881 1.0925 1.0999 1.0946 1.0770 1.0653
irintensity: 0.9124 0.1431 0.3596 0.3437 1.1637 0.8334 1.1715 2.1173 7.8668 1.8908 2.4959 0.6855 1.2634 1.3027 8.5148 4.6544 8.6850 5.2694 11.1805 5.2390 4.1463 0.9488 1.2880 127.2028 38.2376 20.8056 31.9524 6.0693 1.6952 7.4207 28.9696 4.7830 2.8486 26.5268 0.7256 34.4779 102.9934 32.8868 24.4372 19.3867 25.4624 0.4491 8.9564 12.5731 8.6187 3.4414 541.1524 9.7459 324.8044 65.3702 30.5064 59.5080 24.5005 35.2934 94.0625 136.3783 143.9181 86.4798 11.0381 20.8256 27.6354 15.6464 9.8377 42.0263 37.5317 20.0485 43.8465 5.2401 216.1246 192.1047 271.2593 595.2505 8.8078 6.3693 9.3023 3.0696 5.3367 5.6650 3.1441 70.1386 83.8871
temp: 298.150 k
press: 1.00000 atm
elementType: 9 8 8 8 8 8 7 7 6 6 6 6 6 6 6 6 6 6 6 6 1 1 1 1 1 1 1 1 1
symmnumber: 1
zpe: 522286.8 jmol-1
zpe.correction: 0.198929 hartree
zpe.thermalcorrener: 0.215973 hartree
zpe.thermalcorrenthalpy: 0.216917 hartree
zpe.thermalcorrgfe: 0.152452 hartree
zpe.sumelectzpe: -1046.730655 hartree
zpe.sumelectthermal: -1046.713611 hartree
zpe.sumelectthermalent: -1046.712667 hartree
zpe.sumelectthermalfe: -1046.777131 hartree
dipole: -4.7437 1.0253 -1.6453
dipole: 5.1246
quadrupole: -131.3645 -102.8261 -121.4904
quadrupole: 13.1470 9.0226 -10.5813
quadrupole: -12.8042 15.7342 -2.9300 13.1470 9.0226 -10.5813
hfenergy: -1046.9295836 hartree
pointgroup: C01 [X(C12H9F1N2O5)]
dipole: -1.8973948 0.1440924 -0.6663726 debye
polarizability: 223.9315408|-14.348945|131.0989187|-3.0680363|-9.658226|127.1967988 unknown
InChI: InChI=1S/C12H9FN2O5/c1-6-8(3-2-4-9(6)20-12(18)19)15-5-7(13)10(16)14-11(15)17/h2-5,14,18H,1H3
charge 0 multiplicity 1
29 atoms
F  3.795645 -1.679508 -1.880659
O  -3.654881 0.043282 0.642633
O  1.364952 1.498313 1.918289
O  5.2120 -0.74743 0.452046
O  -5.139418 -1.540904 1.126096
O  -3.428727 -2.070415 -0.389623
N  1.241239 0.310032 -0.117948
N  3.252675 0.351269 1.132458
C  -0.130528 0.739938 -0.368777
C  -1.2025 0.126101 0.333243
C  -2.498235 0.568148 -0.030286
C  -0.335048 1.744879 -1.338252
C  -0.981966 -0.928634 1.395041
C  1.91272 0.777549 1.046608
C  1.884168 -0.496404 -1.063344
C  -2.739592 1.572819 -0.984056
C  -1.645254 2.169185 -1.643491
C  3.19246 -0.872404 -0.918233
C  4.007415 -0.460921 0.230494
C  -4.00707 -1.274616 0.374772
H  0.530529 2.197359 -1.832849
H  1.287523 -0.815699 -1.920566
H  -1.848664 -0.990819 2.072936
H  -0.838095 -1.925137 0.937944
H  -0.098789 -0.691401 2.008598
H  -3.77033 1.873191 -1.193312
H  -1.812337 2.955697 -2.385067
H  3.758414 0.679448 1.962441
H  -5.425603 -2.475317 0.953264
