program: Gaussian 09
title: 000129556
version: EM64L-G09RevD.01
frameworkgroup: C1[X(C14H17NO5)]
method: RPBEPBE
basis: SDD
operation: Freq
keyword: #p
keyword: freq=noraman
keyword: PBEPBE/SDD
title: #p freq=noraman PBEPBE/SDD
converged: NO YES NO NO
title: Mulliken charges:
elementType: O O O O O N C C C C C C C C C C C C C C H H H H H H H H H H H H H H H H H
charge: -0.262083 -0.280483 -0.429085 -0.458643 -0.411328 -0.014174 -0.086867 -0.177480 -0.144208 -0.001042 -0.191141 -0.733911 0.374721 -0.389713 -0.324509 0.455994 -0.347506 -0.375718 -0.596376 -0.124053 0.235502 0.220048 0.268864 0.251622 0.280038 0.220164 0.211887 0.250785 0.353283 0.351451 0.336895 0.257210 0.290525 0.239600 0.236158 0.257086 0.256491
chargesum: 0.00000
title: Mulliken charges with hydrogens summed into heavy atoms:
elementType: O O O O O N C C C C C C C C C C C C C C
charge: -0.262083 -0.280483 -0.075802 -0.107193 -0.074433 -0.014174 0.148635 0.042568 0.124656 0.250580 0.088898 -0.051074 0.374721 -0.132504 -0.033984 0.455994 -0.107906 -0.139561 -0.082799 -0.124053
polarizability: 2.24071864e+02 -7.54746832e+00 1.45785749e+02 2.55577696e+00 7.32289389e+00 1.41834957e+02
1716.lowfreq: -19.3102 -7.6632 -5.5246 -0.0005 0.0004 0.0008 0.8638 21.6353 40.9979
frequency: -12.3604 21.2901 40.9704 50.2948 67.3868 89.6277 96.0203 125.6131 166.2606 189.5755 196.0306 232.8695 242.2837 248.7538 254.1376 287.6648 305.8698 326.8730 344.9697 352.6328 355.2362 382.4551 410.8855 414.7011 430.8393 435.2039 448.0162 453.2350 506.8440 518.0889 577.8866 603.1385 631.2879 643.5816 717.7704 749.5808 771.3373 788.3718 821.9661 829.9072 834.2228 846.4456 883.8025 909.3520 920.0812 922.9896 953.5365 966.6677 968.9516 987.4568 1003.7840 1007.2810 1030.5693 1048.5903 1058.5217 1101.6448 1116.6139 1119.6551 1153.2623 1172.8231 1180.4914 1185.3414 1203.2930 1208.6681 1213.7037 1242.5029 1246.3583 1276.6254 1292.8505 1296.0922 1304.9354 1311.0767 1329.3115 1332.9659 1363.0785 1375.3803 1384.2552 1385.5929 1391.1179 1393.9978 1417.7396 1448.8774 1463.6653 1475.0815 1498.6775 1590.8941 1621.3937 2195.5685 2957.9062 2971.3386 2987.9266 2999.2392 3013.8837 3049.3062 3053.2860 3083.8524 3098.4999 3099.1632 3129.9177 3133.4877 3168.5696 3173.4509 3524.0649 3540.1320 3586.0918
redmass: 6.3576 6.6795 3.9388 4.5633 7.4905 4.2219 6.3351 5.6068 3.8850 2.0662 1.9043 4.3930 2.7252 4.7140 4.2874 1.2818 2.6549 3.3879 3.9426 3.3310 5.2447 1.7320 2.9520 3.0060 2.5913 1.7210 5.7103 3.5602 3.5126 3.4220 4.9930 6.0432 4.2892 6.4632 4.0765 4.3883 3.5832 3.5352 4.6059 1.4780 2.4550 1.9367 2.5941 1.8230 2.6077 3.6727 1.4816 1.4194 4.1799 3.1523 5.2898 2.8712 3.0366 2.4187 2.5532 2.0876 1.3336 2.2891 2.1338 1.3577 1.2423 1.1400 1.7890 1.8433 2.2389 1.3570 1.2781 1.5709 1.2314 1.4729 1.2683 1.2995 1.2655 1.2296 1.5324 1.2971 4.0593 1.4210 1.3469 1.4557 3.1788 1.0871 1.0524 1.0447 2.5246 7.1805 6.4725 12.4173 1.0816 1.0841 1.0367 1.0592 1.0858 1.0873 1.1007 1.0994 1.0888 1.0973 1.0905 1.0899 1.0953 1.0952 1.0654 1.0652 1.0667
irintensity: 7.0375 2.1701 0.7447 1.5598 1.0782 3.7561 2.6617 5.2425 23.6664 0.0457 0.6705 15.6505 2.4638 3.3575 4.2196 57.6411 70.7372 1.8291 9.6194 0.4985 10.0972 113.0603 0.0927 22.1335 48.4747 97.1730 4.4984 36.8205 21.2610 2.9393 4.3170 12.3240 82.4775 6.8718 2.2752 7.8574 25.3525 19.1420 18.6444 8.7326 17.0435 45.2150 140.1140 1.4722 167.3731 1.8761 11.5471 11.8546 183.5333 22.2908 74.3731 12.3948 87.2507 49.1750 50.4393 46.9908 11.3563 17.9406 1.3003 136.8035 36.8752 12.0945 44.6992 126.9278 61.8839 20.7216 19.2551 1.8194 1.6655 1.5488 11.5585 1.6225 20.7314 5.6971 1.6124 20.9151 7.9620 5.9140 12.0836 32.7710 1.8170 27.5575 6.4926 13.6106 146.4047 6.9452 47.5192 10.5132 3.3297 54.8590 19.8354 11.2506 21.7555 18.4470 2.5481 27.4763 7.9734 26.1027 11.3310 13.3966 4.2281 0.4045 4.0447 16.7004 11.0298
temp: 298.150 k
press: 1.00000 atm
elementType: 8 8 8 8 8 7 6 6 6 6 6 6 6 6 6 6 6 6 6 6 1 1 1 1 1 1 1 1 1 1 1 1 1 1 1 1 1
symmnumber: 1
zpe: 761634.6 jmol-1
zpe.correction: 0.290091 hartree
zpe.thermalcorrener: 0.309162 hartree
zpe.thermalcorrenthalpy: 0.310106 hartree
zpe.thermalcorrgfe: 0.242223 hartree
zpe.sumelectzpe: -973.004333 hartree
zpe.sumelectthermal: -972.985262 hartree
zpe.sumelectthermalent: -972.984318 hartree
zpe.sumelectthermalfe: -973.052200 hartree
dipole: 0.5763 0.9335 1.3512
dipole: 1.7405
quadrupole: -135.1585 -121.4815 -115.0766
quadrupole: 41.9446 -8.4307 6.8820
quadrupole: -11.2530 2.4241 8.8289 41.9446 -8.4307 6.8820
hfenergy: -973.2944238 hartree
pointgroup: C01 [X(C14H17N1O5)]
dipole: -0.2518578 -0.4586509 0.4417355 debye
polarizability: 223.3400569|-10.2707569|149.3870888|-3.6521317|-5.7773939|138.9654248 unknown
InChI: InChI=1S/C14H17NO5/c1-8-11(16)12(17)13(18)14(19-8)20-10-4-2-9(3-5-10)6-7-15/h2-5,8,11-14,16-18H,6H2,1H3
charge 0 multiplicity 1
37 atoms
O  -1.725366 -0.741061 1.160219
O  -0.581825 1.016607 -0.082804
O  -4.723773 1.392755 -0.908806
O  -4.089706 -1.238347 -1.759114
O  -3.714114 1.288711 1.85193
N  5.866278 -2.103332 -0.954261
C  -3.448675 0.755607 -0.609161
C  -3.605288 -0.768127 -0.448119
C  -2.859172 1.391003 0.667597
C  -2.247271 -1.412888 -0.075147
C  -1.5152 0.701269 0.993087
C  -2.32651 -2.900804 0.257596
C  0.792904 0.742696 0.111076
C  1.663192 1.324707 -0.83908
C  1.303331 -0.061813 1.157498
C  3.585807 0.312202 0.308243
C  3.050317 1.104946 -0.737981
C  2.698485 -0.263205 1.246953
C  5.093747 0.065003 0.403831
C  5.527158 -1.133074 -0.347756
H  -2.722893 0.927315 -1.434264
H  -4.357395 -0.990303 0.34066
H  -2.721002 2.472048 0.513329
H  -1.531483 -1.233258 -0.901421
H  -1.126574 1.033942 1.972192
H  -3.045676 -3.087672 1.07586
H  -2.634436 -3.480727 -0.631376
H  -1.338007 -3.272971 0.574874
H  -5.106112 0.908607 -1.686794
H  -4.488277 -2.138993 -1.668238
H  -3.75383 0.335251 2.12745
H  1.241172 1.94326 -1.636763
H  0.630701 -0.550124 1.867169
H  3.719983 1.555978 -1.479632
H  3.093023 -0.891336 2.054645
H  5.400888 -0.06467 1.458562
H  5.655399 0.934798 0.014246
