program: Gaussian 09
title: 000129512
version: EM64L-G09RevD.01
frameworkgroup: C1[X(C12H13NO3)]
method: RPBEPBE
basis: SDD
operation: Freq
keyword: #p
keyword: freq=noraman
keyword: PBEPBE/SDD
title: #p freq=noraman PBEPBE/SDD
converged: YES YES NO NO
title: Mulliken charges:
elementType: O O O N C C C C C C C C C C C C H H H H H H H H H H H H H
charge: -0.286652 -0.416940 -0.237706 -0.574475 -0.168953 0.359360 -0.505761 -0.427188 -0.513942 0.289814 0.152789 -0.420756 0.190102 -0.358651 -0.239172 -0.220657 0.250903 0.242133 0.232452 0.250371 0.215656 0.291504 0.246047 0.250989 0.282921 0.282061 0.224023 0.227536 0.382192
chargesum: 0.00000
title: Mulliken charges with hydrogens summed into heavy atoms:
elementType: O O O N C C C C C C C C C C C C
charge: -0.286652 -0.034748 -0.237706 -0.009493 0.081950 0.359360 -0.031177 0.038840 -0.222438 0.289814 0.152789 -0.174709 0.190102 -0.107662 -0.015149 0.006880
polarizability: 2.05074707e+02 1.43651132e+01 1.39506331e+02 -2.05981923e+00 1.95363035e+01 9.98627883e+01
1716.lowfreq: -5.0088 0.0005 0.0006 0.0008 4.2293 8.6543 32.7501 43.5715 55.9383
frequency: 32.7275 43.5450 55.9252 69.2600 89.4355 128.5446 150.9206 182.6891 247.6593 256.9069 269.5504 314.0666 331.0404 342.9508 405.7391 423.0948 447.3765 478.4639 541.7562 550.0558 570.5398 601.3805 604.2628 625.7316 671.5655 700.0782 749.7983 753.1960 794.4588 813.1556 833.4301 853.0382 864.3184 866.6475 897.5002 937.7270 946.8395 970.1868 976.4449 1007.0563 1044.5566 1059.8267 1095.0754 1118.1035 1130.1654 1158.2367 1161.0489 1162.2295 1181.0026 1219.2502 1256.7305 1268.1175 1298.7757 1304.1487 1312.9983 1321.3663 1332.4817 1362.7829 1412.5770 1441.5848 1451.5911 1461.0609 1464.1051 1585.1869 1598.5231 1623.9814 1634.6135 1662.2419 2990.3376 2994.1241 3001.4188 3064.9679 3078.9338 3132.3034 3146.2699 3161.0253 3174.6259 3221.8837 3516.9933 3524.3017 3659.4414
redmass: 5.4249 6.3561 7.9077 4.2796 3.0417 4.7128 2.8057 4.3799 4.2048 1.7386 2.2522 1.5116 2.7209 3.2851 2.9887 2.8163 3.2295 4.2055 4.0547 4.4028 3.6771 1.5815 5.6620 4.5902 2.6243 4.5549 3.9602 1.2413 3.8416 2.1267 1.3242 3.1711 1.5157 2.9479 5.2082 1.3895 2.7111 2.5186 1.3037 2.0877 2.6714 1.7659 2.1733 3.7197 1.9985 1.9095 1.2639 1.4624 1.3732 1.8058 2.1665 1.3504 1.4245 2.0619 2.1206 1.2917 1.1813 1.4791 4.4873 2.9783 1.0990 1.0945 2.9215 7.4025 7.0486 7.8568 1.1034 8.3891 1.0765 1.0614 1.0668 1.1047 1.0989 1.0855 1.0906 1.0962 1.0990 1.0986 1.0640 1.0443 1.1015
irintensity: 0.4128 1.5145 2.1615 2.1348 2.5437 1.3587 6.0126 1.4032 5.6294 95.4043 106.5165 134.7232 96.9597 31.3583 31.8414 20.3107 23.5106 8.4389 17.9808 26.9181 0.6564 71.8785 10.6454 15.0097 80.9446 16.4656 1.7888 86.4947 6.3416 15.7063 29.4050 5.0359 8.7661 17.4586 5.0130 3.7509 43.3309 28.4924 0.0317 11.6049 26.7355 160.1545 8.1315 62.6432 57.1573 50.3222 3.5879 8.1135 24.1181 3.5989 17.4252 8.9544 12.6223 40.8121 29.6952 4.9180 8.5499 0.5923 9.4980 30.0843 23.6979 9.9890 5.1422 20.8583 9.7124 2.6171 40.3161 231.2320 4.8939 26.4307 24.4461 17.6315 14.6591 1.7921 11.3563 24.7519 15.7732 2.1963 28.7229 12.1919 6.1926
temp: 298.150 k
press: 1.00000 atm
elementType: 8 8 8 7 6 6 6 6 6 6 6 6 6 6 6 6 1 1 1 1 1 1 1 1 1 1 1 1 1
symmnumber: 1
zpe: 599257.6 jmol-1
zpe.correction: 0.228245 hartree
zpe.thermalcorrener: 0.243242 hartree
zpe.thermalcorrenthalpy: 0.244187 hartree
zpe.thermalcorrgfe: 0.184848 hartree
zpe.sumelectzpe: -744.327377 hartree
zpe.sumelectthermal: -744.312380 hartree
zpe.sumelectthermalent: -744.311435 hartree
zpe.sumelectthermalfe: -744.370774 hartree
dipole: 1.4609 0.5600 0.6815
dipole: 1.7066
quadrupole: -78.0263 -99.8978 -91.3481
quadrupole: 3.0536 1.9164 0.0070
quadrupole: 11.7311 -10.1404 -1.5907 3.0536 1.9164 0.0070
hfenergy: -744.555622 hartree
pointgroup: C01 [X(C12H13N1O3)]
dipole: 0.5968703 0.01106 0.3072811 debye
polarizability: 206.9391325|9.2118604|109.6578259|2.4809693|25.4879299|127.8468679 unknown
InChI: InChI=1S/C12H13NO3/c13-7-9(6-12(14)15)11-5-8-3-1-2-4-10(8)16-11/h1-5,9,14H,6-7,13H2
charge 0 multiplicity 1
29 atoms
O  -0.424706 0.712475 1.119666
O  3.06059 -2.256227 0.242853
O  2.287215 -2.290945 -1.946104
N  3.57495 2.364004 0.803279
C  1.887675 0.486092 0.290582
C  0.422041 0.267103 0.054489
C  2.752197 -0.125352 -0.840888
C  2.202152 2.030014 0.446503
C  -0.335309 -0.235606 -0.988009
C  -1.73454 -0.124875 -0.603785
C  -1.747656 0.461792 0.69604
C  -2.971075 -0.458607 -1.211409
C  2.657089 -1.632124 -0.949106
C  -2.913954 0.733878 1.423348
C  -4.161486 -0.193606 -0.500562
C  -4.135753 0.393692 0.796798
H  2.172865 -0.000212 1.245253
H  2.475972 0.30155 -1.820425
H  3.805974 0.13907 -0.625671
H  1.516674 2.426954 1.216662
H  1.945292 2.537255 -0.503025
H  0.054618 -0.660677 -1.911002
H  -3.003863 -0.911374 -2.207915
H  -2.878285 1.184165 2.419322
H  4.28146 2.366234 0.069755
H  3.907103 2.086692 1.726304
H  -5.127771 -0.443513 -0.95223
H  -5.078622 0.585576 1.320172
H  2.969753 -3.242327 0.140805
