program: Gaussian 09
title: 000129500
version: EM64L-G09RevD.01
frameworkgroup: C1[X(C19H28O2)]
method: RPBEPBE
basis: SDD
operation: Freq
keyword: #pfreq=noraman
keyword: PBEPBE/SDD
title: #p freq=noraman PBEPBE/SDD
converged: YES YES NO NO
title: Mulliken charges:
elementType: O O C C C C C C C C C C C C C C C C C C C H H H H H H H H H H H H H H H H H H H H H H H H H H H H
charge: -0.180836 -0.449309 -0.110238 -0.134322 -0.154073 0.312931 0.254096 -0.525764 -0.521607 -0.478842 -0.539857 0.537559 -0.645637 -0.512977 0.042203 -0.511348 -0.796372 -0.489917 -0.446456 -0.449679 -0.429514 0.211357 0.215623 0.221071 0.210043 0.214521 0.215226 0.223609 0.212081 0.213834 0.235110 0.216030 0.219166 0.213743 0.194041 0.239105 0.247743 0.246022 0.241186 0.229470 0.228713 0.204474 0.203524 0.204834 0.199813 0.208646 0.204193 0.215835 0.340946
chargesum: 0.00000
title: Mulliken charges with hydrogens summed into heavy atoms:
elementType: O O C C C C C C C C C C C C C C C C C C C
charge: -0.180836 -0.108363 0.101119 0.081301 0.066998 0.312931 0.254096 -0.101199 -0.082772 -0.052927 -0.088718 0.537559 -0.212727 -0.079832 0.042203 -0.017583 -0.097003 -0.081919 -0.041809 -0.241032 -0.009486
polarizability: 2.36133033e+02 1.04862115e+00 1.85477238e+02 -9.08015673e+00 -3.97683846e-01 1.72572805e+02
1716.lowfreq: -0.0008 -0.0006 -0.0006 2.4512 9.8139 16.9702 45.9683 51.0349 74.7241
frequency: 45.9175 50.8240 74.7228 94.8383 106.2700 145.1755 158.0436 159.2193 186.4290 200.2431 216.1559 231.3432 240.7159 259.1526 278.3908 280.6054 289.1122 316.3522 343.9437 358.7894 368.3346 392.5055 412.1987 424.1334 448.0422 466.4271 482.9444 515.7082 536.9364 543.0082 560.5425 572.9424 617.1196 636.5648 665.5549 693.9367 719.3213 798.4049 804.6909 813.8781 822.9626 825.9332 847.6107 866.2790 880.7475 888.5867 915.9977 927.3058 940.4475 961.3666 971.9952 985.6620 989.1934 996.4102 1000.1028 1009.8068 1017.4024 1028.3371 1039.8344 1064.2875 1068.0545 1082.2167 1084.8418 1100.4859 1110.3366 1115.5918 1121.4776 1132.8387 1161.0083 1161.5208 1168.9876 1182.5155 1190.9539 1193.3710 1198.5991 1211.6984 1228.2193 1237.9968 1242.9160 1257.0904 1263.5169 1268.5203 1273.0859 1281.3117 1289.5542 1299.3261 1313.3527 1320.7732 1322.3061 1325.4046 1328.4509 1338.1614 1339.2727 1345.6730 1349.2979 1362.2468 1369.6756 1379.5129 1398.6697 1427.9421 1456.8549 1458.6591 1461.2983 1465.9110 1469.6040 1471.6433 1475.1000 1482.5150 1486.4896 1488.9516 1492.7857 1653.2930 1683.7039 2904.9547 2933.1671 2944.7510 2952.6691 2955.2118 2962.5565 2970.9484 2975.3770 2977.3707 2979.8142 2986.3586 2987.8104 2998.6495 3000.3051 3004.9101 3008.9322 3021.9565 3032.9284 3038.0383 3039.1678 3044.1704 3048.9390 3056.7049 3072.2319 3078.5339 3083.5854 3085.8310 3567.6424
redmass: 3.9688 3.9585 3.7870 4.6805 3.0959 3.8538 1.9680 3.1321 2.1786 2.1057 1.7796 1.4395 1.9225 2.7627 2.6687 2.3984 3.4577 2.2916 2.0054 2.8750 2.2876 3.1631 2.8792 3.1719 2.9712 2.6642 3.5622 2.8946 2.3896 2.9072 3.2551 3.6752 4.0364 2.2227 3.2108 2.9063 3.1673 2.2164 1.8102 1.4319 1.9469 1.7682 2.0252 2.2793 1.5751 2.1771 1.9777 1.8360 1.8469 2.3106 3.2283 2.1237 2.1380 2.5224 1.8495 1.9100 2.1350 2.2795 2.0614 2.7529 2.6348 1.6437 1.9957 1.7645 2.5942 1.8883 1.6184 1.5685 1.6970 1.9758 1.8874 1.5539 1.6325 1.3051 1.5510 1.4987 1.4489 1.8236 1.3757 1.6743 1.4382 1.3240 1.3813 1.3762 1.4494 1.2937 1.3950 1.3502 1.4435 1.3145 1.6493 1.5580 1.4782 1.5120 1.4491 1.5951 1.4341 1.1924 1.3391 1.0800 1.0879 1.0749 1.0861 1.0903 1.0875 1.0733 1.0910 1.0828 1.0748 1.0767 1.0719 12.0644 7.8260 1.0808 1.0804 1.0562 1.0634 1.0684 1.0745 1.0634 1.0622 1.0623 1.0596 1.0437 1.0583 1.0597 1.1022 1.0662 1.0939 1.0982 1.0998 1.1007 1.0966 1.1022 1.1002 1.0984 1.1019 1.0994 1.0904 1.0991 1.0666
irintensity: 0.2925 1.7242 3.9379 5.9850 1.4177 0.4578 1.2443 1.7277 0.0999 1.0492 10.2515 80.7950 28.2476 11.3935 0.6053 0.2870 1.9553 1.1381 1.5427 4.7249 0.1173 1.1459 2.6017 1.9706 0.3810 0.8438 1.6909 0.8935 0.3367 0.4331 3.9297 5.4242 1.2279 5.0283 22.4598 1.5021 7.5057 0.3592 1.1355 9.1761 17.9778 2.7409 1.9547 4.1788 20.8500 2.5506 3.7091 5.6335 3.9592 9.0093 59.9890 10.6536 14.4268 6.7067 15.1377 1.9287 16.6930 15.5858 31.1259 2.0694 5.3401 0.6707 7.2436 5.6901 2.2577 5.4195 6.4162 11.1300 7.3982 2.7202 6.3143 5.4808 13.2412 1.2495 3.5803 10.0757 5.5621 13.3573 1.0062 3.8124 1.2895 0.0412 1.0970 1.9841 0.3506 1.7050 0.7062 0.7267 1.3764 0.9120 2.1333 1.3890 2.3747 0.6237 1.9749 0.6294 6.6434 20.7049 1.0080 18.0273 5.4363 5.6054 3.6128 15.2357 5.6374 3.1204 9.2104 13.5470 19.3908 0.7498 10.5607 193.1911 2.0382 11.9007 6.3157 50.7204 55.3437 16.5512 43.4030 29.7782 14.9123 27.1183 25.0201 11.1855 55.6074 25.0105 61.7694 11.2938 50.8777 76.3431 26.4828 46.6360 62.4757 63.6637 33.9494 8.9972 42.1682 18.2876 39.0068 29.2114 3.1330
temp: 298.150 k
press: 1.00000 atm
elementType: 8 8 6 6 6 6 6 6 6 6 6 6 6 6 6 6 6 6 6 6 6 1 1 1 1 1 1 1 1 1 1 1 1 1 1 1 1 1 1 1 1 1 1 1 1 1 1 1 1
symmnumber: 1
zpe: 1128059.4 jmol-1
zpe.correction: 0.429655 hartree
zpe.thermalcorrener: 0.449359 hartree
zpe.thermalcorrenthalpy: 0.450303 hartree
zpe.thermalcorrgfe: 0.383489 hartree
zpe.sumelectzpe: -889.620123 hartree
zpe.sumelectthermal: -889.600419 hartree
zpe.sumelectthermalent: -889.599475 hartree
zpe.sumelectthermalfe: -889.666290 hartree
dipole: 1.2243 1.2980 2.0803
dipole: 2.7407
quadrupole: -151.7583 -127.1092 -118.8754
quadrupole: -13.8623 -5.4809 -4.7688
quadrupole: -19.1773 5.4718 13.7055 -13.8623 -5.4809 -4.7688
hfenergy: -890.0497785 hartree
pointgroup: C01 [X(C19H28O2)]
dipole: -0.4832417 -0.4806622 0.8355197 debye
polarizability: 236.177719|1.0338832|185.4748365|8.9342164|-0.0819722|172.53052 unknown
InChI: InChI=1S/C19H28O2/c1-18-11-9-16-14(15(18)7-8-17(18)21)6-5-13-4-2-3-10-19(13,16)12-20/h4,14-16,20H,2-3,5-12H2,1H3
charge 0 multiplicity 1
49 atoms
O  4.79914 1.149487 -0.908027
O  -3.347123 0.405552 2.314011
C  0.420043 -0.792097 0.384752
C  -0.398387 0.43833 -0.156752
C  1.828677 -0.728671 -0.241744
C  2.593132 0.579681 0.119395
C  -1.912542 0.424753 0.326313
C  0.353314 1.777877 0.113859
C  1.810509 1.789729 -0.429071
C  -0.280822 -2.138926 0.088058
C  2.864762 -1.856529 0.012608
C  -2.483087 -0.960729 -0.030445
C  -1.753563 -2.144434 0.578631
C  -2.769324 1.551791 -0.333296
C  3.974247 0.295789 -0.502783
C  4.181912 -1.237689 -0.539992
C  2.874803 0.74749 1.647758
C  -1.967299 0.655767 1.863213
C  -3.238386 1.218091 -1.763864
C  -3.481058 -1.143321 -0.937967
C  -4.144849 -0.031637 -1.728103
H  0.519566 -0.703784 1.487929
H  -0.441217 0.31011 -1.262127
H  1.673847 -0.696867 -1.346705
H  0.370042 1.992501 1.200631
H  -0.195639 2.614745 -0.355639
H  1.792261 1.739943 -1.536512
H  2.311555 2.738776 -0.160388
H  0.283691 -2.965159 0.563805
H  -0.270172 -2.323225 -1.006514
H  2.600718 -2.797505 -0.499358
H  2.950975 -2.082388 1.092159
H  -1.773052 -2.099948 1.686454
H  -2.248098 -3.089616 0.286834
H  -2.212808 2.507577 -0.319941
H  -3.666102 1.694231 0.300365
H  4.358292 -1.529574 -1.593534
H  5.093617 -1.517238 0.018399
H  3.488386 1.652636 1.805846
H  1.939984 0.862402 2.221631
H  3.424466 -0.111097 2.073508
H  -1.677558 1.705923 2.080711
H  -1.267393 -0.019433 2.395745
H  -2.368374 1.023323 -2.422501
H  -3.783365 2.080542 -2.193889
H  -3.821132 -2.170664 -1.138091
H  -4.367469 -0.384179 -2.754839
H  -5.123693 0.229539 -1.272015
H  -3.42422 0.644124 3.271578
