program: Gaussian 09
title: 000012030
version: EM64L-G09RevD.01
frameworkgroup: C1[X(C7H6N2O5)]
method: RPBEPBE
basis: SDD
operation: Freq
keyword: #pfreq=noraman
keyword: PBEPBE/SDD
title: #p freq=noraman PBEPBE/SDD
converged: YES YES NO YES
title: Mulliken charges:
elementType: O O O O O N N C C C C C C C H H H H H H
charge: -0.357956 -0.197652 -0.196236 -0.162508 -0.258827 0.021151 0.030840 0.446298 0.262180 0.335954 -0.487238 -0.530784 0.117865 -0.767006 0.279722 0.336674 0.225581 0.262174 0.261959 0.377808
chargesum: 0.00000
title: Mulliken charges with hydrogens summed into heavy atoms:
elementType: O O O O O N N C C C C C C C
charge: 0.019852 -0.197652 -0.196236 -0.162508 -0.258827 0.021151 0.030840 0.446298 0.262180 0.335954 -0.207515 -0.194110 0.117865 -0.017291
polarizability: 1.83055234e+02 -3.94415372e+00 1.38871746e+02 1.43334552e-02 -1.43183723e-02 4.59284015e+01
1716.lowfreq: -8.4105 -2.0013 -0.0008 -0.0001 0.0006 2.2287 15.8730 65.8628 103.3440
frequency: 15.7546 65.8587 103.3386 138.6217 174.3292 219.9535 242.9619 286.6491 331.6672 331.9363 336.4380 354.6417 406.8023 442.4799 471.2280 580.4263 584.1241 601.8399 652.8340 669.1124 705.7528 719.7406 721.8082 755.6423 807.9349 849.1417 883.2887 964.9067 999.8924 1023.6045 1041.0674 1088.0888 1151.2752 1174.6613 1201.9207 1227.8835 1268.1772 1288.3950 1357.6567 1376.5442 1395.1014 1412.7604 1450.6307 1465.3584 1470.0076 1493.0656 1556.2630 1633.6489 2971.1115 3001.8944 3086.0004 3106.7393 3173.9317 3181.9827
redmass: 11.3964 7.2778 7.8163 7.6527 13.6617 1.4645 1.9595 6.5523 8.5249 8.5236 3.9166 9.2377 7.4623 3.1859 10.4043 5.5180 5.7780 5.6534 6.2516 7.4416 4.8526 9.8303 6.5544 12.6882 6.4722 1.0999 1.3464 1.3799 2.4728 1.7959 1.5684 7.5715 3.5382 2.7354 12.7769 1.3735 3.1283 2.6638 10.3574 7.8522 1.7922 1.9119 1.0456 3.8058 1.3524 2.8804 5.3412 6.9088 1.0658 1.0367 1.0954 1.1020 1.0922 1.0915
irintensity: 0.1587 0.5995 0.1275 4.1735 3.9426 3.4766 0.4837 2.7196 0.6293 0.0405 11.7660 4.8199 1.5050 4.1877 1.3947 0.1941 13.5140 1.1087 11.8494 17.0441 4.5354 0.4891 6.9142 16.6147 2.3232 156.4226 0.0042 25.0379 30.1931 19.8656 13.7008 71.8717 246.3443 158.2216 218.3381 40.1090 6.7474 224.6916 242.3594 2.0749 30.7383 23.4953 14.9462 8.4358 46.8608 26.7823 126.9828 238.8023 238.3257 4.3253 3.5181 24.3848 0.1320 21.8519
temp: 298.150 k
press: 1.00000 atm
elementType: 8 8 8 8 8 7 7 6 6 6 6 6 6 6 1 1 1 1 1 1
symmnumber: 1
zpe: 347018.0 jmol-1
zpe.correction: 0.132172 hartree
zpe.thermalcorrener: 0.144183 hartree
zpe.thermalcorrenthalpy: 0.145127 hartree
zpe.thermalcorrgfe: 0.092535 hartree
zpe.sumelectzpe: -754.788490 hartree
zpe.sumelectthermal: -754.776479 hartree
zpe.sumelectthermalent: -754.775534 hartree
zpe.sumelectthermalfe: -754.828126 hartree
dipole: -0.2794 4.1873 0.0000
dipole: 4.1966
quadrupole: -97.8407 -85.5829 -78.1499
quadrupole: -6.0212 -0.0223 0.0108
quadrupole: -10.6495 1.6083 9.0412 -6.0212 -0.0223 0.0108
hfenergy: -754.9206618 hartree
pointgroup: C01 [X(C7H6N2O5)]
dipole: -0.0973391 -1.648142 -0.0145525 debye
dipolederiv: -1.1445778 0.4390861 0.014705 0.3538833 -0.6263005 -0.0070094 0.0139505 -0.0082926 -0.3632625 -0.4877267 0.0745275 0.0047358 0.2227634 -0.8645121 -0.0076998 0.005982 -0.0059267 -0.2254908 -0.9065663 -0.0967018 0.0101725 -0.0666476 -0.4873556 -0.0009368 0.010175 -0.0003493 -0.2076238 -0.4416573 -0.0788801 0.0027069 -0.3243872 -0.8902707 -0.0025762 0.0002492 -0.0061533 -0.1952244 -0.9432692 0.0897158 0.0104915 0.1955995 -0.5224279 -0.005596 0.0115302 -0.0037451 -0.2671807 1.6631564 -0.2459495 -0.0250159 -0.4981039 1.2694327 0.0144961 -0.0268283 0.011425 0.1818508 1.7247267 0.3558885 -0.018017 0.5268562 1.3121764 0.0041586 -0.0163757 0.0064189 0.2124084 0.5750094 0.1365536 -0.0058002 0.0337609 0.5478269 0.0047035 -0.0064198 0.0030064 0.0337607 -0.8638195 0.0760792 0.0130552 -0.0084515 -0.4743874 -0.0042365 0.0121909 -0.0055916 0.0113244 -0.9618171 -0.3622321 0.0097588 -0.0227769 -0.5333277 -0.0049479 0.0131304 -0.0002379 0.0064842 -0.7757468 0.1401358 0.009537 -0.0742795 0.0937726 0.0036303 0.0074308 0.0007164 -0.1667392 0.7597168 0.1158894 -0.0095255 -0.0716915 -0.1630175 -0.0003928 -0.0121972 -0.002709 -0.0264512 1.1578673 -0.497776 -0.01796 -0.1211292 0.6714994 0.0063609 -0.0140941 0.01164 0.160659 -0.3067296 -0.2518068 0.0017806 -0.0736407 0.0832218 0.0019116 0.0039033 0.0042111 0.0062216 0.0793068 -0.0096722 0.0009813 -0.0080414 -0.0144684 -0.0016476 0.0008635 -0.0015695 0.1604776 0.1629677 -0.0184714 -0.0000236 -0.0088036 0.1412304 -0.0002967 0.0003333 -0.0001569 0.178623 0.074417 0.1184177 0.0016623 -0.0155951 -0.1358286 -0.0023344 0.0002051 -0.0042326 0.1105373 0.0815205 0.0038625 0.0618396 -0.0079551 0.0711078 -0.0541685 0.0604546 -0.0314566 0.0057864 0.0779149 0.0062507 -0.0637961 -0.0051669 0.0688644 0.0556282 -0.0628606 0.0327081 0.010713 0.4753067 0.0050831 -0.0012882 -0.0261932 0.4527639 0.0009536 -0.0016232 0.0002952 0.3731262 unknown
polarizability: 182.9657909|4.2980415|138.9271884|-1.8739455|0.8232962|45.9624019 unknown
InChI: InChI=1S/C7H6N2O5/c1-4-2-7(10)6(9(13)14)3-5(4)8(11)12/h2-3,10H,1H3
charge 0 multiplicity 1
20 atoms
O  2.36962 -1.985836 -0.068396
O  -2.285457 2.332104 0.033924
O  -3.585962 0.465785 0.040879
O  2.457528 2.233379 -0.028774
O  3.597259 0.258971 -0.065572
N  -2.433482 1.048857 0.026807
N  2.472103 0.954631 -0.042349
C  -1.254709 -1.23228 -0.012218
C  -1.207845 0.208829 0.001558
C  1.221632 0.203675 -0.031718
C  -0.017762 -1.904772 -0.03599
C  0.006615 0.911045 -0.008398
C  1.230216 -1.234503 -0.045883
C  -2.519744 -2.062233 -0.003582
H  0.009413 -2.997723 -0.04738
H  0.005352 2.004416 0.002266
H  -2.268638 -3.135251 -0.018236
H  -3.137658 -1.847141 0.884936
H  -3.161874 -1.828915 -0.870043
H  3.164092 -1.338237 -0.072532
