program: Gaussian 09
title: 000129439
version: EM64L-G09RevD.01
frameworkgroup: C1[X(C10H19N3O4)]
method: RPBEPBE
basis: SDD
operation: Freq
keyword: #p
keyword: freq=noraman
keyword: PBEPBE/SDD
title: #p freq=noraman PBEPBE/SDD
converged: YES YES NO NO
title: Mulliken charges:
elementType: O O O O N N N C C C C C C C C C C H H H H H H H H H H H H H H H H H H H
charge: -0.426451 -0.269673 -0.221583 -0.323490 -0.400329 -0.364132 -0.595605 -0.051283 -0.119647 -0.706593 -0.719894 -0.205519 0.219379 0.127705 -0.735423 0.270066 -0.452542 0.244658 0.285088 0.395955 0.244239 0.221179 0.207256 0.237235 0.214989 0.218361 0.272931 0.240728 0.242771 0.222923 0.314062 0.386602 0.216716 0.216056 0.276703 0.316562
chargesum: 0.00000
title: Mulliken charges with hydrogens summed into heavy atoms:
elementType: O O O O N N N C C C C C C C C C C
charge: -0.039849 -0.269673 -0.221583 -0.323490 -0.004373 -0.050070 -0.002339 0.193374 0.165442 -0.033919 -0.049310 0.067412 0.219379 0.127705 -0.029002 0.270066 -0.019770
polarizability: 1.53391839e+02 -8.73072526e-02 1.46746994e+02 -3.26430015e+00 8.57706509e+00 1.22823460e+02
1716.lowfreq: -13.9859 -0.0008 -0.0006 -0.0004 1.0568 3.9235 17.0644 33.7659 50.5166
frequency: 15.1860 33.6157 50.4980 58.2398 65.0547 74.2991 88.4657 89.5905 127.3142 149.3115 156.4516 193.0646 210.8486 220.1556 240.5351 241.7272 253.0674 271.5060 284.7690 316.4628 322.0852 335.5609 400.2218 410.8536 440.9249 460.2080 530.7489 537.4629 562.3145 593.1494 596.8460 619.0776 643.3090 680.0841 690.0740 745.3323 746.0011 805.2768 838.0092 890.6042 897.4426 918.2309 934.6139 937.6196 962.2148 994.4112 1032.2438 1052.6038 1081.0784 1110.7045 1114.5438 1133.3320 1137.0649 1149.3494 1175.4155 1181.1090 1200.2668 1222.9928 1237.5490 1241.1297 1287.4184 1296.7746 1314.0711 1329.4458 1341.0546 1347.2570 1378.0409 1384.3236 1392.4278 1402.4098 1457.8778 1468.2715 1470.8221 1475.0759 1478.9959 1483.1344 1486.9904 1487.7625 1501.8661 1574.2837 1617.3446 1640.8807 1663.0200 2859.1939 2960.5575 2974.3825 2982.0603 2996.7535 2998.5284 3018.4464 3028.4911 3067.6634 3073.3334 3077.3075 3088.2563 3098.6594 3106.9355 3401.0559 3476.0583 3521.0360 3539.6010 3623.7202
redmass: 4.3742 4.5894 6.4077 3.1093 6.3043 3.8663 3.8896 4.4886 3.6560 3.4588 4.7523 1.0894 1.1547 2.6272 1.4597 1.1770 1.8244 4.2801 3.6078 5.1091 5.0163 2.9822 3.5417 4.8027 2.6446 3.4782 2.1114 2.6863 1.2664 2.7379 1.6829 1.7070 3.8173 3.6737 3.3224 1.1904 5.9877 4.2863 3.0100 2.4992 4.3349 1.4133 2.7190 1.6789 1.4919 1.9079 1.7546 1.8169 4.3762 2.0089 1.8775 2.1403 1.9739 2.3535 1.7699 2.0619 1.3405 2.0045 1.3478 1.7013 1.7430 1.2327 1.6928 1.3365 1.4403 1.7165 1.5181 1.2127 1.2231 1.2121 1.0640 1.0524 1.0557 1.2041 1.0787 1.0525 1.0942 1.6994 1.7852 2.8702 4.4969 1.5038 8.7451 1.0711 1.0862 1.0361 1.0361 1.0842 1.0361 1.0848 1.0835 1.0991 1.0999 1.0993 1.0993 1.1011 1.0987 1.0812 1.0470 1.0643 1.0781 1.0972
irintensity: 0.3107 0.4259 1.6299 5.5750 6.4657 3.4387 9.4912 5.0416 4.2951 0.8929 0.3477 0.3719 0.0410 2.5103 20.8452 46.2616 3.0041 0.8292 8.1754 7.0496 23.6985 0.7070 5.3666 6.7017 3.2530 1.9974 11.1393 44.5479 291.2383 14.8705 140.7086 101.0888 11.5124 7.2810 29.5726 135.6517 13.2455 0.7752 19.4780 25.4697 12.7352 9.2678 24.9483 2.8960 1.0285 3.5251 4.4434 134.7757 7.9002 23.1626 36.9069 25.2467 12.6519 9.7148 9.3675 8.7636 4.5167 22.2512 9.6548 42.4995 28.9682 4.1763 9.7911 20.9762 4.5081 7.2326 25.5339 20.8167 32.2293 20.4244 23.7512 9.9454 3.0993 68.2299 16.1871 4.9969 15.6004 119.5335 318.8927 133.7247 245.2400 12.7727 214.3048 80.9832 56.8865 24.0909 27.3312 7.1370 20.6012 5.6085 8.7690 25.7675 17.4627 45.1115 28.8095 18.4635 18.3951 134.5355 13.2177 30.7584 24.8053 15.2133
temp: 298.150 k
press: 1.00000 atm
elementType: 8 8 8 8 7 7 7 6 6 6 6 6 6 6 6 6 6 1 1 1 1 1 1 1 1 1 1 1 1 1 1 1 1 1 1 1
symmnumber: 1
zpe: 776817.9 jmol-1
zpe.correction: 0.295874 hartree
zpe.thermalcorrener: 0.316083 hartree
zpe.thermalcorrenthalpy: 0.317027 hartree
zpe.thermalcorrgfe: 0.245471 hartree
zpe.sumelectzpe: -856.298912 hartree
zpe.sumelectthermal: -856.278704 hartree
zpe.sumelectthermalent: -856.277759 hartree
zpe.sumelectthermalfe: -856.349316 hartree
dipole: -2.8646 -1.5428 1.1767
dipole: 3.4599
quadrupole: -109.8575 -101.3248 -97.1910
quadrupole: -8.5801 -9.1787 -5.9689
quadrupole: -7.0664 1.4663 5.6001 -8.5801 -9.1787 -5.9689
hfenergy: -856.5947863 hartree
pointgroup: C01 [X(C10H19N3O4)]
dipole: -1.2563835 -0.5203169 0.0608015 debye
polarizability: 153.1988688|-2.778985|132.9396215|0.3893432|14.8064083|136.8238033 unknown
InChI: InChI=1S/C10H19N3O4/c1-5(2)8(10(16)17)13-9(15)6(3)12-7(14)4-11/h5-6,8,12-13,16H,4,11H2,1-3H3
charge 0 multiplicity 1
36 atoms
O  1.998386 -0.11951 -2.404075
O  0.621811 1.66416 1.871432
O  4.034492 -0.416246 -1.331463
O  -1.743121 0.007005 -1.65194
N  0.727181 0.681267 -0.24147
N  -2.310384 0.985694 0.373528
N  -4.037672 -1.5081 -1.679582
C  1.848753 -1.326007 0.809014
C  2.018572 0.033097 0.021735
C  3.187479 -1.81621 1.401374
C  1.160044 -2.412956 -0.046057
C  -1.261058 2.03174 0.289968
C  0.116803 1.446835 0.725173
C  2.810399 -0.174886 -1.262073
C  -1.641578 3.240799 1.153342
C  -2.486221 0.045095 -0.613914
C  -3.605555 -0.982103 -0.387295
H  1.179825 -1.054484 1.649747
H  2.607919 0.703812 0.675094
H  0.21947 0.47771 -1.115849
H  3.917801 -2.060171 0.610116
H  3.640984 -1.048439 2.054899
H  3.02037 -2.724428 2.009266
H  0.228784 -2.040858 -0.511303
H  0.904369 -3.284969 0.583136
H  1.826042 -2.771481 -0.853825
H  -1.192939 2.316476 -0.7768
H  -1.630759 2.974848 2.224788
H  -0.903346 4.048096 1.01765
H  -2.637438 3.623665 0.868573
H  -2.912638 0.97666 1.199718
H  2.548307 -0.294339 -3.214733
H  -4.443638 -0.496033 0.154972
H  -3.184282 -1.755457 0.304153
H  -4.506412 -2.413845 -1.659756
H  -3.319651 -1.412236 -2.405041
