program: Gaussian 09
title: 000129403
version: EM64L-G09RevD.01
frameworkgroup: C1[X(C7H9N3O4S)]
method: RPBEPBE
basis: SDD
operation: Freq
keyword: #p
keyword: freq=noraman
keyword: PBEPBE/SDD
title: #p freq=noraman PBEPBE/SDD
converged: YES YES NO NO
title: Mulliken charges:
elementType: S O O O O N N N C C C C C C C H H H H H H H H H
charge: 0.265657 -0.197293 -0.274636 -0.146210 -0.133267 -0.370168 -0.055136 0.210968 -0.391129 -0.259020 0.265352 0.150289 -0.132594 -0.627526 -0.721294 0.247527 0.260508 0.239241 0.257893 0.353742 0.303046 0.260345 0.246601 0.247103
chargesum: 0.00000
title: Mulliken charges with hydrogens summed into heavy atoms:
elementType: S O O O O N N N C C C C C C C
charge: 0.265657 -0.197293 -0.274636 -0.146210 -0.133267 -0.016425 -0.055136 0.210968 0.116906 0.238115 0.265352 0.150289 -0.132594 -0.324480 0.032754
polarizability: 1.70971362e+02 7.47363288e-01 1.48810705e+02 -9.47352597e+00 1.23708279e+01 8.16094960e+01
1716.lowfreq: -1.7857 -0.0011 0.0012 0.0025 5.1806 9.8212 22.8010 23.2924 44.6578
frequency: 22.7884 23.2890 44.6518 64.3128 68.7015 91.7792 108.1657 144.1684 184.1256 197.3979 230.5371 248.3333 285.7970 307.7717 361.9342 441.0932 469.8414 486.8952 503.1205 556.2689 580.0215 609.9761 630.6237 643.8014 716.4493 724.8474 743.7745 754.9310 793.0919 824.3998 847.5037 888.0749 923.9092 984.5326 1015.3023 1036.9744 1056.7742 1091.5607 1122.4133 1152.1561 1164.6012 1194.9951 1212.4229 1265.7331 1297.5142 1342.9184 1363.1004 1397.0987 1446.2207 1456.1537 1456.5040 1461.6895 1479.3754 1519.4545 1527.5135 1545.4230 1607.4010 2993.6190 3003.6776 3018.0784 3067.1964 3075.0154 3098.5592 3116.1546 3252.1880 3508.9691
redmass: 5.5932 10.3752 12.3623 3.3243 1.3393 5.2730 5.0763 7.1404 3.9070 4.8648 6.5487 3.9672 3.1308 5.5247 3.2249 5.9273 4.9126 5.3314 4.5728 7.2323 4.9994 9.0067 6.3069 13.5528 1.1595 4.2967 3.5055 9.9503 3.6349 1.6126 3.6599 4.0244 2.9591 2.4521 2.9239 1.4132 1.7271 2.1026 3.0939 2.5721 10.0846 1.1575 1.9734 1.3496 3.1110 1.3081 1.3541 1.2318 1.1105 1.1080 1.0524 1.0830 2.4552 13.0421 4.5469 6.6642 8.0210 1.0369 1.0598 1.0574 1.1021 1.0980 1.1088 1.0991 1.0962 1.0782
irintensity: 2.9254 0.7011 0.6507 5.6054 0.4140 1.9127 2.7693 1.0427 4.3267 4.3292 7.1324 6.4326 5.1196 6.6249 16.1522 2.8885 4.6543 0.4061 1.7252 8.3480 9.1681 2.3097 33.8189 6.9236 186.6376 14.6645 27.5146 197.8516 14.7991 27.0860 9.1474 27.4815 11.2234 1.2883 28.7528 2.8968 3.3964 52.8034 18.9705 47.4322 256.0453 3.5376 33.1778 61.7949 35.0981 5.5656 6.5967 17.4810 38.8029 31.0788 22.1623 16.0431 158.3237 227.3647 159.0737 80.1241 192.1273 10.6079 38.5333 15.9923 8.9323 10.1786 24.8893 4.3729 9.5345 49.8861
temp: 298.150 k
press: 1.00000 atm
elementType: 16 8 8 8 8 7 7 7 6 6 6 6 6 6 6 1 1 1 1 1 1 1 1 1
symmnumber: 1
zpe: 441743.0 jmol-1
zpe.correction: 0.168251 hartree
zpe.thermalcorrener: 0.183631 hartree
zpe.thermalcorrenthalpy: 0.184576 hartree
zpe.thermalcorrgfe: 0.122051 hartree
zpe.sumelectzpe: -1134.115739 hartree
zpe.sumelectthermal: -1134.100359 hartree
zpe.sumelectthermalent: -1134.099414 hartree
zpe.sumelectthermalfe: -1134.161939 hartree
dipole: 2.5114 1.1912 1.0970
dipole: 2.9882
quadrupole: -92.5005 -98.3868 -94.2427
quadrupole: 17.5320 -4.2506 -1.2412
quadrupole: 2.5428 -3.3435 0.8006 17.5320 -4.2506 -1.2412
hfenergy: -1134.28399 hartree
pointgroup: C01 [X(C7H9N3O4S1)]
dipole: -1.0294756 -0.4138654 0.3886576 debye
dipolederiv: -0.396495 0.1041034 -0.209444 -0.1252768 -0.2175458 0.0759232 -0.1579227 0.1478873 0.0148554 -0.7623556 0.4468854 0.1927271 0.3816193 -0.7284017 -0.1253963 0.3253686 -0.2352681 -0.3876184 -0.7222112 -0.1266714 -0.0450253 0.0077553 -0.9950645 0.1545641 -0.142437 0.1570385 -0.4272074 -0.5646576 0.0453265 0.2999521 -0.0495203 -0.4404893 0.1991117 0.4367135 0.0692135 -0.5159358 -0.3925596 0.1944955 0.0918529 0.388997 -0.98246 0.1264204 0.085902 0.1537596 -0.2866456 -1.288497 0.2004129 -0.2069984 0.1170578 -0.5165043 0.0241113 -0.2719457 0.0641698 -0.5731583 -0.8093555 -0.0438996 -0.2064557 -0.1340796 -0.3622701 0.0227315 -0.2024499 0.0486924 -0.2533184 1.3259443 -0.6294856 -0.6074377 -0.6256816 1.6607692 -0.199861 -0.8468755 0.0410161 0.8967666 0.7142626 -0.0109632 0.0766656 0.429899 -0.0104252 0.0970868 -0.0305228 0.0999526 0.3063393 0.217809 -0.012687 0.0591005 -0.2711507 0.5797799 0.0302062 0.1491926 -0.102521 0.1772703 -0.3309533 -0.1279393 -0.0860105 -0.1053364 -0.0335501 -0.0127046 -0.1050892 -0.0205256 0.0191395 1.6074117 0.052334 0.3865327 -0.0092045 1.2023659 -0.2554387 0.5269357 -0.3023844 0.4462443 0.5729579 -0.2246567 0.3239735 -0.0325104 0.5996402 -0.2442261 0.264047 -0.3071354 0.1138875 0.2882169 0.1617867 0.139069 0.1848529 -0.059233 0.0117716 0.1451333 0.0019576 -0.1963567 -0.0338658 -0.0341825 -0.0270902 -0.0759046 -0.1894303 0.0593291 -0.0155933 0.0716677 0.0417134 -0.0663891 -0.0131766 -0.0641732 -0.059228 0.1354117 0.0399876 -0.0797853 -0.0174977 -0.1120642 0.1009442 0.0727079 0.0265011 -0.1014142 0.0127932 -0.0115348 0.0896508 0.0270202 0.1170573 -0.1445742 -0.0720741 -0.0433716 0.0376666 -0.0421108 -0.0167721 -0.0453004 -0.0036744 0.0779195 0.0851883 0.014067 -0.0296302 0.0639894 -0.0129692 -0.0453672 -0.0546936 0.0236836 -0.0669928 0.3580648 0.0165992 -0.0418574 -0.0014653 0.2035196 0.0345079 -0.0473827 0.0488537 0.3111881 0.1408659 -0.0426429 -0.0187646 -0.0181007 0.0905029 0.0354141 -0.0233637 0.0246669 0.1977172 0.005897 0.0774015 -0.0751682 0.0184551 0.0406725 0.0360766 -0.0545044 0.0576514 0.0941208 -0.015408 -0.0192839 0.1117935 0.0104083 0.0542138 -0.0020737 0.0981408 0.040897 0.0422015 0.1097594 -0.0284573 -0.0467408 -0.0318275 0.0107856 -0.0338675 -0.0432182 -0.0891213 -0.0371229 unknown
polarizability: 169.8748322|0.6101881|148.2523451|13.3133559|-14.1106286|83.2643855 unknown
InChI: InChI=1S/C7H9N3O4S/c1-5-9-6(4-15-5)7(11)8-2-3-14-10(12)13/h4,8H,2-3H2,1H3
charge 0 multiplicity 1
24 atoms
S  -4.452151 -0.068726 -0.716291
O  2.786006 -0.506398 0.705247
O  -0.71835 2.75962 -0.206406
O  4.4976 -0.6272 -0.942396
O  3.96325 -2.463568 0.328688
N  0.208569 0.84939 0.786565
N  -2.083259 -0.616891 0.369489
N  3.859551 -1.270241 -0.052569
C  1.496151 1.474453 1.076825
C  2.646228 0.9037 0.235352
C  -2.044998 0.72907 -0.050703
C  -0.810987 1.544865 0.158836
C  -3.237458 -1.20206 0.115496
C  -3.201255 1.202066 -0.647358
C  -3.605757 -2.619816 0.430505
H  1.74082 1.37729 2.150781
H  1.394377 2.549194 0.837441
H  3.589761 1.447762 0.420927
H  2.410056 0.915822 -0.842192
H  0.034261 -0.131803 1.026678
H  -3.374822 2.202351 -1.037004
H  -2.747278 -3.11223 0.914269
H  -4.473113 -2.671319 1.113065
H  -3.866602 -3.18343 -0.483343
