program: Gaussian 09
title: 000129381
version: EM64L-G09RevD.01
frameworkgroup: C1[X(C6H12ClN3O3)]
method: RPBEPBE
basis: SDD
operation: Freq
keyword: #p
keyword: freq=noraman
keyword: PBEPBE/SDD
title: #p freq=noraman PBEPBE/SDD
converged: NO YES NO NO
title: Mulliken charges:
elementType: Cl O O O N N N C C C C C C H H H H H H H H H H H H
charge: -0.038732 -0.454881 -0.254468 -0.230151 -0.393655 -0.181443 0.038755 -0.026878 -0.376562 -0.680486 -0.334413 0.327720 -0.567625 0.224511 0.233500 0.238738 0.347244 0.207704 0.222490 0.242985 0.276210 0.270190 0.280469 0.289812 0.338968
chargesum: 0.00000
title: Mulliken charges with hydrogens summed into heavy atoms:
elementType: Cl O O O N N N C C C C C C
charge: -0.038732 -0.115914 -0.254468 -0.230151 -0.046411 -0.181443 0.038755 0.197632 0.095676 -0.007308 0.211987 0.327720 0.002656
polarizability: 1.44946805e+02 2.75032486e+00 1.12657186e+02 -1.06584394e+01 2.82222981e+00 7.34495527e+01
1716.lowfreq: -8.4271 -3.9869 0.0020 0.0027 0.0036 6.3937 20.0645 33.0983 45.5087
frequency: 19.7542 32.5726 45.4554 54.2595 65.0517 70.7494 131.4566 174.8569 189.3761 212.8358 228.7344 259.8657 269.2874 303.4585 331.7319 362.9521 412.6782 441.0539 450.9106 472.7261 570.6267 681.3310 691.1958 709.3988 724.5375 777.3164 813.9921 824.2157 890.7628 910.8725 943.0843 1001.1765 1040.6011 1049.9982 1053.5937 1102.0305 1133.4688 1164.6266 1213.1062 1230.3884 1245.2399 1266.1184 1268.4784 1310.7748 1327.1549 1341.2216 1360.1216 1371.9967 1378.4928 1396.0654 1430.6962 1437.2809 1455.5409 1460.1046 1478.9061 1489.9835 1662.3384 2970.6913 2993.4235 3015.6451 3045.4828 3069.6725 3083.3598 3093.5388 3105.4359 3120.7109 3159.2088 3510.1124 3550.9705
redmass: 5.9503 4.8819 6.8806 2.9446 4.6639 4.3563 7.6047 5.3997 1.0602 6.6769 5.7187 4.7596 3.0640 1.2164 2.8866 3.7577 4.5982 2.6508 5.1656 7.1176 4.6512 1.1175 6.3678 8.9151 2.6905 1.5193 3.8973 3.5789 2.0655 2.0595 1.8672 4.0306 2.1376 1.4964 3.8350 1.9998 2.1376 2.9265 1.7594 1.2500 2.1365 1.4003 1.2121 1.2434 1.2269 1.2198 1.3712 5.5484 1.4099 1.3428 1.1076 1.1092 1.0935 1.0506 1.0847 1.8002 9.3857 1.0853 1.0365 1.0586 1.0594 1.0558 1.1045 1.1011 1.0996 1.1047 1.1129 1.0778 1.0659
irintensity: 1.4950 0.5060 0.7627 1.8595 4.3049 2.9523 11.9829 8.5647 6.2993 3.9660 7.0100 6.8327 25.4631 169.8967 5.5986 26.0691 15.2498 7.4378 6.1790 9.3433 5.0124 73.7721 31.3255 39.9898 1.8425 46.2416 58.0659 20.8933 5.4368 88.2096 60.5813 18.8179 96.7421 19.9847 4.7461 13.3087 25.1075 32.9253 8.8817 54.5729 10.8923 62.1419 5.9807 15.1390 32.3896 10.2575 21.9913 153.3673 4.7227 27.4199 23.0220 19.0453 9.9384 10.6106 52.5175 352.4568 198.7937 25.8143 14.5727 32.5377 1.7405 12.7960 0.0734 39.2904 23.4020 1.1486 2.5169 51.9623 3.2040
temp: 298.150 k
press: 1.00000 atm
elementType: 17 8 8 8 7 7 7 6 6 6 6 6 6 1 1 1 1 1 1 1 1 1 1 1 1
symmnumber: 1
zpe: 505152.2 jmol-1
zpe.correction: 0.192402 hartree
zpe.thermalcorrener: 0.207716 hartree
zpe.thermalcorrenthalpy: 0.208660 hartree
zpe.thermalcorrgfe: 0.146725 hartree
zpe.sumelectzpe: -1084.734985 hartree
zpe.sumelectthermal: -1084.719671 hartree
zpe.sumelectthermalent: -1084.718727 hartree
zpe.sumelectthermalfe: -1084.780663 hartree
dipole: -1.9403 -0.2272 1.2000
dipole: 2.2927
quadrupole: -99.2568 -95.2696 -79.8248
quadrupole: 3.9727 -3.1592 -1.1360
quadrupole: -7.8064 -3.8192 11.6256 3.9727 -3.1592 -1.1360
hfenergy: -1084.9273877 hartree
pointgroup: C01 [X(C6H12Cl1N3O3)]
dipole: 0.7636856 0.0633679 0.4758015 debye
dipolederiv: -0.5304337 0.2062656 -0.0686926 0.1877529 -0.2533301 0.0301508 -0.115403 0.055482 -0.2082356 -0.2899719 0.0228101 0.1758961 0.0586938 -0.7201768 -0.1345971 0.2259581 -0.1034313 -0.6214846 -0.7265955 -0.0800515 -0.0378062 0.1393817 -0.9099511 0.155076 -0.1062628 0.112447 -0.380681 -0.6112068 -0.8199273 0.0826935 -0.1790812 -0.7350495 0.0865798 -0.046646 -0.0958807 -0.169306 -1.3971285 0.062295 -0.1032158 0.291937 -0.4345471 0.0600911 -0.2018174 0.0311189 -0.5077642 -0.8187273 -0.1435575 -0.0592944 -0.6936426 -1.1007875 0.0554301 0.1316181 0.1219482 -0.1507812 0.0816135 0.6474873 -0.0891302 0.515615 1.3438128 -0.2138585 -0.1615057 -0.1611892 -0.0268562 0.3312415 0.0184421 -0.0758644 -0.0553948 0.5988209 0.0906178 -0.1725837 0.1525855 0.3969853 0.5728235 0.0933749 0.0885354 0.1776057 0.1328329 0.0503576 0.1494401 -0.0498037 0.1542119 -0.1378351 -0.1040301 -0.0209347 -0.0350303 0.0204915 -0.0374713 0.0764967 -0.0276886 0.0367334 0.2274706 -0.0674769 0.0185974 -0.1267545 0.0381447 0.0147277 -0.0458152 0.0066368 0.1432746 2.1025729 0.3252019 0.2695496 -0.0243968 1.2329806 -0.2201246 0.4864141 -0.1327599 0.3977044 0.6582956 -0.2631573 0.1271964 -0.2379497 0.2931554 -0.0718307 0.1212802 -0.027613 0.1722795 -0.021821 0.0769611 -0.0788262 0.0453675 -0.0685598 0.0419184 -0.0669131 0.048104 -0.0845757 -0.0360361 0.0111972 -0.0690875 0.0140894 0.0497071 0.1068248 -0.0623392 0.0608845 -0.0248082 0.0283629 0.0572461 0.0303227 -0.0407395 -0.0549212 -0.0890708 0.0088834 -0.0386669 0.0688319 0.2908482 -0.0097753 -0.0192467 0.006461 0.2069627 0.0233479 -0.063247 0.0033147 0.2977687 0.0920565 0.058776 0.0110339 0.0148314 -0.1143344 -0.078303 -0.0107011 -0.0806801 0.0765578 0.0444863 0.010924 -0.0578426 0.0650411 0.0318428 0.1096987 -0.1062121 0.0833554 -0.033572 -0.03925 -0.0229575 0.093765 -0.0121899 0.1111909 0.0007945 0.1247049 0.0138092 -0.0441418 0.087151 0.0069213 0.0519776 0.024155 0.063299 0.0688262 0.0636411 0.0374848 0.0608049 0.0318258 0.0098125 -0.0424415 -0.0454307 0.0235512 -0.0815706 0.0037001 -0.0217384 0.0704549 -0.0019748 0.0377808 -0.0056849 -0.007622 -0.001213 0.108163 0.0077174 0.0518401 0.0018643 -0.0161868 -0.02815 -0.0839919 0.010058 0.0048732 -0.0485352 -0.0573322 -0.0350591 0.0314458 0.0784192 -0.1064124 -0.137508 -0.0927574 0.2412049 -0.0272427 -0.1830756 -0.0045001 0.343289 unknown
polarizability: 144.9849967|1.0709586|111.7931269|11.0091512|-6.1004352|74.2754205 unknown
InChI: InChI=1S/C6H12ClN3O3/c1-5(11)4-8-6(12)10(9-13)3-2-7/h5,8,11H,2-4H2,1H3
charge 0 multiplicity 1
25 atoms
Cl -4.817188 1.541766 -0.358517
O  3.604257 -1.059129 -0.792233
O  0.020815 1.571837 -0.21323
O  -2.229555 -2.428247 0.173816
N  1.081817 -0.35688 0.601809
N  -1.195242 -0.43838 -0.082868
N  -1.138506 -1.781174 0.313056
C  3.312871 0.319143 -0.348519
C  2.371833 0.300471 0.880718
C  4.663723 0.95207 -0.010923
C  -2.409638 0.184778 -0.656851
C  0.022156 0.348552 0.093509
C  -3.28812 0.794767 0.448473
H  2.816516 0.886213 -1.164604
H  2.864079 -0.251858 1.701021
H  2.176179 1.336748 1.209664
H  0.92756 -1.340828 0.840885
H  4.536823 1.995321 0.329458
H  5.171267 0.375424 0.783264
H  5.313553 0.94906 -0.901577
H  -2.084663 0.969458 -1.356973
H  -2.964999 -0.603704 -1.192603
H  -3.658738 0.039766 1.156382
H  -2.783024 1.623111 0.964994
H  2.776423 -1.457284 -1.165151
