program: Gaussian 09
title: 000129389
version: EM64L-G09RevD.01
frameworkgroup: C1[X(C17H15NO5)]
method: RPBEPBE
basis: SDD
operation: Freq
keyword: #p
keyword: freq=noraman
keyword: PBEPBE/SDD
title: #p freq=noraman PBEPBE/SDD
converged: YES YES NO NO
title: Mulliken charges:
elementType: O O O O O N C C C C C C C C C C C C C C C C C H H H H H H H H H H H H H H H
charge: -0.373196 -0.194179 -0.291488 -0.390367 -0.435454 -0.325534 0.284084 0.175761 0.526795 0.012011 0.338983 -0.642390 -0.287081 0.033406 -0.498604 0.207497 -0.624671 0.139377 -0.422337 -0.360663 -0.352814 -0.192368 -0.322993 0.299975 0.236991 0.219027 0.279573 0.291260 0.255925 0.173770 0.235755 0.262890 0.240120 0.236797 0.177427 0.364679 0.387168 0.334869
chargesum: 0.00000
title: Mulliken charges with hydrogens summed into heavy atoms:
elementType: O O O O O N C C C C C C C C C C C C C C C C C
charge: -0.008517 -0.194179 -0.291488 -0.003199 -0.100585 -0.069608 0.284084 0.175761 0.526795 0.012011 0.338983 -0.342415 -0.287081 0.033406 -0.042586 0.207497 -0.345099 0.139377 -0.131077 0.048862 -0.089924 0.047752 0.091230
polarizability: 3.81660087e+02 -4.21767856e+00 2.32741046e+02 1.04083846e+01 -3.66818442e-01 9.68001883e+01
1716.lowfreq: -7.0430 -4.6758 -0.0003 0.0005 0.0009 1.7603 17.7742 33.5817 48.7819
frequency: 17.7466 33.5729 48.7797 50.9006 68.4579 93.4442 120.3051 134.4744 159.3586 165.1787 182.6325 194.4208 212.6069 223.6533 240.9275 301.5978 308.4116 317.7480 348.0271 364.3857 378.9216 424.4392 432.9981 437.2965 447.4261 452.9919 464.6439 499.0584 513.6303 534.5886 553.2078 556.8103 582.8897 636.0808 656.3261 660.6556 706.8219 723.9242 729.8087 759.8100 798.3761 805.9516 815.0790 857.3903 885.5536 895.7316 928.9794 941.4219 948.9120 966.0062 976.1819 977.6187 998.0700 1000.4096 1019.6801 1042.0146 1054.1452 1070.0342 1103.0568 1109.8034 1148.1042 1154.3285 1167.1873 1170.2934 1181.2607 1223.0828 1235.3118 1246.6394 1273.6488 1283.2944 1292.6201 1295.4868 1318.2032 1334.9091 1346.1826 1361.3832 1391.0930 1405.3920 1409.8161 1424.6912 1441.1055 1449.6158 1457.4231 1468.4457 1475.2643 1478.6276 1490.1336 1536.3876 1548.8949 1575.4346 1587.8635 1608.5269 1629.5031 2653.3057 2843.8125 2885.8454 2938.1895 2983.3328 3032.1961 3098.9111 3115.5190 3145.1190 3147.4273 3168.7472 3179.2814 3432.7156 3532.0613 3558.8852
redmass: 6.1642 6.6653 3.0348 6.5592 2.5459 3.4601 9.7700 4.1541 5.0412 2.8806 5.3538 5.1698 4.9291 4.8801 4.9900 6.1377 3.6823 1.2703 5.6351 6.3494 4.9551 10.5074 3.0108 6.8046 1.4689 4.9049 8.1016 4.2879 5.1595 7.9726 5.4635 5.3404 4.5735 5.5054 4.0169 4.8458 1.3624 3.0199 5.8062 5.8670 8.0608 1.7722 1.1168 2.6563 2.5910 2.4173 1.3821 5.2233 1.7726 4.5941 2.1274 1.0688 1.3714 4.5788 1.9644 2.9908 2.8527 2.2047 1.8782 2.8015 3.0818 1.1922 1.4609 1.4206 1.5748 1.6798 1.3629 1.7462 1.2248 2.2772 1.6147 2.3541 2.3573 1.9431 3.8317 1.4207 1.4797 6.9577 5.0484 3.6869 2.9812 3.4341 1.2565 1.0898 1.2504 2.5290 1.0894 4.3535 6.6086 4.0710 6.2358 6.1195 6.2737 1.0714 1.0714 1.0702 1.0710 1.0875 1.0868 1.0941 1.0913 1.0878 1.0918 1.0925 1.0983 1.0741 1.0656 1.0662
irintensity: 1.0626 1.1418 6.2429 5.4732 4.3115 0.8438 0.4708 2.6909 1.0374 3.8910 0.4069 0.5827 0.4870 0.5985 0.4517 5.0785 24.0761 129.9057 23.2937 3.2130 41.6172 22.6633 21.7925 7.6366 96.1984 15.0519 2.3817 5.1331 2.7930 1.4255 6.0964 1.5998 1.7230 3.8279 7.3085 9.3554 93.5632 5.9080 2.6526 14.1884 30.1009 66.6696 3.2266 0.3505 16.7754 32.9230 0.9347 29.9809 5.7074 113.0366 8.8180 131.4020 2.1472 42.5120 36.6527 7.2137 11.9676 27.8865 16.8491 86.3962 70.5437 1.3401 17.0107 74.4721 52.2899 35.3662 23.6688 60.2204 62.4028 199.0306 258.1505 32.8920 393.8880 52.5110 60.9454 26.5982 9.4167 6.9802 17.7408 60.1269 19.8785 231.4184 23.4783 17.9761 4.0513 43.0531 8.3375 78.2807 170.7955 35.5117 63.3643 64.4555 42.8311 223.2000 152.6263 67.8057 67.7732 14.3636 28.1676 26.9103 5.7761 10.6232 3.6772 0.5793 15.1689 0.2479 39.0614 10.1777
temp: 298.150 k
press: 1.00000 atm
elementType: 8 8 8 8 8 7 6 6 6 6 6 6 6 6 6 6 6 6 6 6 6 6 6 1 1 1 1 1 1 1 1 1 1 1 1 1 1 1
symmnumber: 1
zpe: 753999.5 jmol-1
zpe.correction: 0.287183 hartree
zpe.thermalcorrener: 0.307441 hartree
zpe.thermalcorrenthalpy: 0.308386 hartree
zpe.thermalcorrgfe: 0.236846 hartree
zpe.sumelectzpe: -1086.040034 hartree
zpe.sumelectthermal: -1086.019776 hartree
zpe.sumelectthermalent: -1086.018831 hartree
zpe.sumelectthermalfe: -1086.090371 hartree
dipole: -3.6474 -1.9545 1.2943
dipole: 4.3358
quadrupole: -130.6324 -140.5045 -132.7651
quadrupole: -1.8615 -9.5123 -1.1430
quadrupole: 4.0016 -5.8705 1.8689 -1.8615 -9.5123 -1.1430
hfenergy: -1086.3272169 hartree
pointgroup: C01 [X(C17H15N1O5)]
dipole: 1.4596382 -0.8525577 -0.2290294 debye
polarizability: 381.169603|12.0716677|218.2302611|8.247789|-42.5078081|111.8014576 unknown
InChI: InChI=1S/C17H15NO5/c19-5-4-18-8-9-6-11-15(13(21)7-9)17(23)14-10(16(11)22)2-1-3-12(14)20/h1-3,6-7,18-21H,4-5,8H2
charge 0 multiplicity 1
38 atoms
O  0.44566 2.750742 -0.831626
O  -1.148151 -2.857501 1.012283
O  -2.17507 2.251494 -0.825257
O  -4.643345 1.814146 -0.817484
O  8.337091 0.342888 -0.214625
N  4.587485 -0.156327 -0.19152
C  -0.262485 -0.716624 0.330513
C  -0.509532 0.61436 -0.147616
C  2.162044 -0.337236 0.350911
C  -3.004517 0.122001 -0.12774
C  -2.776862 -1.205738 0.348436
C  1.047688 -1.17889 0.569132
C  -1.38674 -1.679058 0.592968
C  -1.89803 1.060212 -0.390216
C  3.574467 -0.824242 0.649788
C  0.630745 1.451848 -0.369407
C  1.9406 0.970975 -0.122469
C  -4.357698 0.554913 -0.358859
C  -3.857888 -2.077499 0.590166
C  5.989301 -0.367725 0.222157
C  -5.438409 -0.335747 -0.109793
C  -5.184838 -1.635779 0.359449
C  6.936414 0.50862 -0.620244
H  1.167995 -2.206993 0.926833
H  3.81606 -0.585463 1.706178
H  3.594434 -1.938266 0.575969
H  2.817039 1.609615 -0.295228
H  -3.643346 -3.086087 0.954589
H  4.444211 -0.363476 -1.190067
H  6.31501 -1.438054 0.146273
H  6.091603 -0.076509 1.284236
H  -6.454765 0.023729 -0.294503
H  -6.024539 -2.312954 0.547853
H  6.713893 1.573685 -0.452784
H  6.804714 0.288241 -1.703732
H  1.321759 3.207594 -0.926059
H  -3.724966 2.298006 -0.933395
H  8.61137 -0.5974 -0.36391
