program: Gaussian 09
title: 000129351
version: EM64L-G09RevD.01
frameworkgroup: C1[X(C14H18N2O)]
method: RPBEPBE
basis: SDD
operation: Freq
keyword: #p
keyword: freq=noraman
keyword: PBEPBE/SDD
title: #p freq=noraman PBEPBE/SDD
converged: YES YES NO NO
title: Mulliken charges:
elementType: O N N C C C C C C C C C C C C C C H H H H H H H H H H H H H H H H H H
charge: -0.240977 -0.632228 -0.424903 0.159045 -0.230796 0.083714 -0.445235 -0.513879 -0.405579 0.171766 0.422408 -0.541733 0.337661 -0.732997 -0.489664 0.073900 -0.839395 0.205869 0.193387 0.201424 0.221421 0.219987 0.200865 0.233797 0.246037 0.225651 0.234990 0.246082 0.242696 0.265312 0.294227 0.321612 0.231397 0.229770 0.234368
chargesum: 0.00000
title: Mulliken charges with hydrogens summed into heavy atoms:
elementType: O N N C C C C C C C C C C C C C C
charge: -0.240977 -0.072689 -0.103291 0.159045 -0.024928 0.083714 -0.050424 -0.072471 0.029082 0.171766 0.422408 -0.070045 0.337661 -0.498007 -0.000885 0.073900 -0.143859
polarizability: 2.27643468e+02 8.24441578e+00 1.76850945e+02 -2.88390325e+00 3.08681697e+00 1.01738003e+02
1716.lowfreq: -8.7783 -7.0384 -0.0004 0.0004 0.0008 8.6300 58.5957 84.1055 96.2143
frequency: 58.5785 84.0918 96.1872 116.1155 147.7061 154.4910 182.3900 205.2775 222.5140 254.8297 275.1218 283.3215 319.9157 347.7728 357.2812 379.3494 402.0345 460.7042 468.9996 496.0119 508.2632 530.4680 551.7367 575.7693 604.2616 615.5906 629.4391 691.0574 708.1024 741.1822 765.8327 777.4272 824.6357 854.7330 872.6892 882.3142 908.3023 933.9279 949.9844 999.9730 1004.6609 1009.1641 1028.2871 1034.9019 1042.1964 1080.0932 1095.1807 1118.0709 1156.7693 1161.0715 1165.8488 1194.1252 1212.4671 1218.5087 1223.3832 1258.8886 1294.6952 1304.9090 1312.7572 1318.3870 1331.0931 1335.7044 1347.0519 1353.7200 1369.3560 1374.4159 1395.8420 1403.2256 1440.7607 1445.7843 1459.6863 1461.0134 1464.4433 1467.3233 1471.0368 1477.7336 1483.3769 1593.2009 1616.1495 1629.8943 1637.5550 2853.6646 2937.8038 2954.9039 2970.0790 2976.8369 2990.1800 2994.9511 3010.9498 3033.9176 3043.9000 3056.0828 3059.7335 3082.7841 3087.4760 3114.8509 3456.7925 3518.0756 3593.5410
redmass: 4.5784 3.2994 3.6814 2.7011 3.9053 1.0611 1.8338 1.7609 2.2906 2.5658 2.6045 2.8109 4.6424 3.3401 3.2096 2.9569 4.1501 3.1736 4.3519 2.8783 2.7955 1.6754 2.5430 2.5694 3.2384 3.1376 4.4804 2.4703 1.7914 3.1094 3.7530 3.0661 2.4366 2.2368 1.5212 2.1276 2.3428 2.5817 3.0966 1.8599 2.0130 2.0476 2.2404 1.7838 1.6804 1.9459 2.1388 1.9817 1.3154 1.2070 1.4106 1.5986 1.6024 1.5658 2.2700 1.2177 2.7338 1.3683 1.3691 1.6254 2.6376 1.7437 1.6625 1.6480 1.9508 3.5516 1.5955 1.5832 1.6905 1.0992 1.1998 1.1485 1.1315 1.0818 1.2409 2.4094 1.3962 7.4001 6.9802 1.1294 5.1901 1.0810 1.0671 1.0697 1.0382 1.0608 1.0655 1.0668 1.0869 1.1000 1.0966 1.0912 1.1033 1.0981 1.0955 1.0913 1.0450 1.0762 1.0981
irintensity: 2.6219 0.0827 0.1662 0.3341 3.9802 0.8830 16.0205 12.0401 7.8860 1.9424 1.6041 0.6305 2.3032 5.3363 1.7793 0.6814 4.2832 3.6446 5.7199 2.3139 18.2276 93.2972 83.4608 36.8568 4.0585 2.1373 3.1758 6.8090 69.3161 12.6638 0.7488 7.2280 4.9350 0.8922 31.5996 7.0431 0.7054 4.0885 1.2103 1.4803 2.6644 3.6627 5.0817 9.3951 13.6608 6.4148 3.0423 2.7943 1.3291 3.1834 2.6066 81.5576 20.0170 5.8852 9.1023 6.6215 10.3267 3.3031 18.4202 34.8338 91.2249 2.5741 49.2512 3.9061 1.4278 10.8962 2.1902 21.0267 40.5045 11.8440 9.5248 4.2158 16.5204 17.6016 5.0406 5.2470 70.2938 53.0422 40.8317 45.4063 505.0736 80.8923 36.1751 27.9417 34.7689 49.4468 20.3007 33.6626 46.2460 62.1017 18.5848 20.3218 35.8453 21.6532 15.8557 19.4819 1.1366 19.7815 0.3451
temp: 298.150 k
press: 1.00000 atm
elementType: 8 7 7 6 6 6 6 6 6 6 6 6 6 6 6 6 6 1 1 1 1 1 1 1 1 1 1 1 1 1 1 1 1 1 1
symmnumber: 1
zpe: 776182.8 jmol-1
zpe.correction: 0.295632 hartree
zpe.thermalcorrener: 0.311022 hartree
zpe.thermalcorrenthalpy: 0.311966 hartree
zpe.thermalcorrgfe: 0.254182 hartree
zpe.sumelectzpe: -727.794159 hartree
zpe.sumelectthermal: -727.778769 hartree
zpe.sumelectthermalent: -727.777825 hartree
zpe.sumelectthermalfe: -727.835610 hartree
dipole: 3.8290 -0.3303 -0.3445
dipole: 3.8587
quadrupole: -127.0710 -85.4422 -102.2894
quadrupole: 0.3904 -2.8867 1.0997
quadrupole: -22.1368 19.4920 2.6448 0.3904 -2.8867 1.0997
hfenergy: -728.0897912 hartree
pointgroup: C01 [X(C14H18N2O1)]
dipole: -1.5090335 0.1092606 -0.1247638 debye
polarizability: 227.4563934|8.8975941|177.0239327|1.8890338|-3.6888572|101.7520899 unknown
InChI: InChI=1S/C14H18N2O/c1-8-7-12-10(5-6-13(17)16-12)14-9(8)3-2-4-11(14)15/h7,11,16H,2-6,15H2,1H3
charge 0 multiplicity 1
35 atoms
O  4.802569 0.095594 -0.073483
N  -1.573761 2.450072 1.124292
N  2.694745 -0.839465 0.204342
C  -0.820593 0.439754 -0.082121
C  -1.536977 1.791546 -0.207132
C  -1.558598 -0.779931 -0.052436
C  -2.978522 1.649718 -0.749187
C  -3.082117 -0.797429 -0.15872
C  -3.74082 0.580581 0.049852
C  0.599469 0.428239 0.016174
C  -0.861389 -2.0216 0.05833
C  1.469772 1.679355 0.078373
C  1.273276 -0.816562 0.11127
C  0.547042 -2.026832 0.133726
C  2.820176 1.460946 -0.642885
C  3.544458 0.210737 -0.145902
C  -1.612614 -3.341718 0.088076
H  -0.967017 2.400317 -0.951973
H  -2.941065 1.372599 -1.82272
H  -3.48621 2.631552 -0.680509
H  -3.363752 -1.189686 -1.160788
H  -3.495847 -1.522125 0.569279
H  -4.803618 0.538343 -0.254146
H  -3.703019 0.862673 1.118506
H  0.953682 2.553874 -0.352734
H  1.677257 1.931063 1.140517
H  1.082307 -2.98234 0.204441
H  3.501623 2.316535 -0.506109
H  2.652387 1.340806 -1.732337
H  -1.836166 3.440814 1.099344
H  -0.758931 2.269588 1.716585
H  3.155085 -1.715294 0.468848
H  -2.259454 -3.423363 0.983066
H  -2.273095 -3.456973 -0.792007
H  -0.91518 -4.196288 0.10077
