program: Gaussian 09
title: 000012021
version: EM64L-G09RevD.01
frameworkgroup: C1[X(C3H6O3)]
method: RPBEPBE
basis: SDD
operation: Freq
keyword: #p
keyword: freq=noraman
keyword: PBEPBE/SDD
title: #p freq=noraman PBEPBE/SDD
converged: YES YES NO YES
title: Mulliken charges:
elementType: O O O C C C H H H H H H
charge: -0.241963 -0.241962 -0.276106 0.323116 -0.505717 -0.505717 0.242519 0.239131 0.242525 0.239131 0.242519 0.242526
chargesum: 0.00000
title: Mulliken charges with hydrogens summed into heavy atoms:
elementType: O O O C C C
charge: -0.241963 -0.241962 -0.276106 0.323116 0.218458 0.218458
polarizability: 5.85001522e+01 7.31218037e-07 3.99255280e+01 -5.20417331e-06 8.08010809e-04 2.97216713e+01
1716.lowfreq: -14.5300 -7.2920 -6.7940 0.0001 0.0010 0.0011 80.1589 93.0460 122.5127
frequency: 80.1367 93.0455 122.5116 188.9449 213.9949 312.5220 475.5749 626.1679 701.0023 830.9524 918.2186 1060.5478 1115.6952 1121.1547 1145.6959 1164.1632 1211.0048 1420.2609 1438.1077 1453.0130 1453.6814 1464.2847 1465.4586 1633.7304 3005.2582 3005.9633 3106.6516 3107.2765 3153.8490 3154.1050
redmass: 1.0520 1.2835 2.2879 4.2507 3.1210 4.5662 5.1258 6.3988 11.9562 5.9951 8.4372 7.1658 1.2537 1.2550 1.4042 1.5457 6.7157 1.1814 1.1796 1.0499 1.0488 1.0535 1.0511 8.1555 1.0300 1.0302 1.1048 1.1050 1.1043 1.1043
irintensity: 0.0000 2.1174 14.7228 0.0000 8.7886 29.8524 1.0499 1.1669 23.7759 23.2616 40.3666 0.3151 0.0000 0.2326 62.2319 0.1040 642.4919 24.5941 44.8567 0.0000 29.3778 8.3400 15.3132 238.1590 59.2163 6.5095 0.0012 57.2992 10.4222 20.6022
temp: 298.150 k
press: 1.00000 atm
elementType: 8 8 8 6 6 6 1 1 1 1 1 1
symmnumber: 1
zpe: 240706.4 jmol-1
zpe.correction: 0.091680 hartree
zpe.thermalcorrener: 0.099041 hartree
zpe.thermalcorrenthalpy: 0.099985 hartree
zpe.thermalcorrgfe: 0.059979 hartree
zpe.sumelectzpe: -343.082544 hartree
zpe.sumelectthermal: -343.075183 hartree
zpe.sumelectthermalent: -343.074238 hartree
zpe.sumelectthermalfe: -343.114244 hartree
dipole: 0.0000 0.1799 0.0006
dipole: 0.1799
quadrupole: -21.8078 -42.6720 -34.4242
quadrupole: 0.0000 0.0000 -0.0005
quadrupole: 11.1602 -9.7040 -1.4562 0.0000 0.0000 -0.0005
hfenergy: -343.1742238 hartree
pointgroup: C01 [X(C3H6O3)]
dipole: -0.0000023 0.0707688 -0.0002451 debye
dipolederiv: -1.4963636 -0.1812697 -0.000075 -0.4146238 -0.5394532 0.000045 -0.0004095 -0.0000735 -0.3030766 -1.4963511 0.1812909 0.0000754 0.4146441 -0.5394668 0.0000445 0.0004121 -0.0000739 -0.3030766 -0.6763038 -0.000004 0.0000002 -0.0000032 -0.9950891 -0.0002647 0.0000004 0.0002914 -0.3345822 2.2504014 -0.0000083 -0.0000009 -0.0000075 1.4872262 0.0002674 -0.0000016 -0.000048 0.3507303 0.7321271 -0.0284718 0.0000991 -0.1661132 0.2266669 -0.000048 0.0000783 -0.0000148 0.2875935 0.7321333 0.0284605 -0.000098 0.1661009 0.2266631 -0.0000467 -0.0000783 -0.0000131 0.2875928 0.0082131 0.0024986 -0.0187006 0.0987341 0.0372437 -0.1016283 0.0330087 -0.0934189 -0.0596123 -0.0392201 -0.0768622 -0.0000464 -0.1225241 -0.0077473 -0.0000483 -0.0000682 -0.000033 0.126614 0.0081863 0.0024159 0.0187732 0.0986437 0.0372303 0.1016783 -0.0329231 0.0934187 -0.0595924 -0.0392166 0.0768632 0.0000478 0.1225254 -0.0077516 -0.0000507 0.0000703 -0.0000354 0.1266142 0.0082097 -0.0024987 0.0186973 -0.0987339 0.0372471 -0.1016289 -0.0330125 -0.0934179 -0.0596147 0.0081843 -0.0024144 -0.0187719 -0.0986426 0.0372306 0.1016803 0.0329233 0.0934184 -0.0595901 unknown
polarizability: 58.5001521|-0.0002018|39.925528|-0.0000052|-0.000808|29.7216713 unknown
InChI: InChI=1S/C3H6O3/c1-5-3(4)6-2/h1-2H3
charge 0 multiplicity 1
12 atoms
O  -1.114083 -0.732763 -0.000072
O  1.114065 -0.732787 -0.000074
O  0.000015 1.33759 -0.000169
C  0.0000 0.084878 0.000306
C  -2.405351 -0.006315 -0.000508
C  2.405348 -0.006368 -0.000512
H  -2.490712 0.626236 0.898986
H  -3.166882 -0.79778 -0.00081
H  -2.490084 0.626315 -0.900006
H  3.166863 -0.797851 -0.000827
H  2.49073 0.626174 0.898987
H  2.490091 0.62627 -0.900001
