program: Gaussian 09
title: 000129261
version: EM64L-G09RevD.01
frameworkgroup: C1[X(C15H19NO2)]
method: RPBEPBE
basis: SDD
operation: Freq
keyword: #p
keyword: freq=noraman
keyword: PBEPBE/SDD
title: #p freq=noraman PBEPBE/SDD
converged: YES YES NO NO
title: Mulliken charges:
elementType: O O N C C C C C C C C C C C C C C C H H H H H H H H H H H H H H H H H H H
charge: -0.388227 -0.269448 -0.086697 -0.412938 -0.412329 -0.538925 -0.535148 0.266016 0.290174 -0.586458 -0.397345 0.522641 -0.427753 -0.336413 -0.125116 -0.470605 0.248725 -0.753737 0.204385 0.207602 0.204997 0.207853 0.221297 0.217878 0.222407 0.219070 0.228519 0.230084 0.226118 0.215902 0.239839 0.259577 0.213731 0.247678 0.257853 0.227706 0.361090
chargesum: 0.00000
title: Mulliken charges with hydrogens summed into heavy atoms:
elementType: O O N C C C C C C C C C C C C C C C
charge: -0.027137 -0.269448 -0.086697 -0.000952 0.000521 -0.099750 -0.093671 0.266016 0.290174 -0.357939 -0.167261 0.522641 -0.201636 -0.120511 0.114723 0.002703 0.248725 -0.020500
polarizability: 2.87686692e+02 -6.22612411e+00 1.66174434e+02 1.25476732e+01 -4.86232994e-01 1.18154889e+02
1716.lowfreq: -9.8226 -0.0004 0.0007 0.0008 4.2540 11.3629 19.5827 26.0777 38.0564
frequency: 17.6271 25.8678 38.0332 56.6699 92.5116 102.2388 111.0685 118.8957 137.2327 174.4323 231.7000 235.9546 259.9011 286.4577 292.8319 306.0632 344.6735 360.3421 403.0729 409.7370 431.6604 444.1786 474.6695 514.9511 546.4408 557.0673 573.3407 591.6181 618.2933 694.5546 709.8195 730.6733 753.8366 815.0060 823.6498 846.6915 864.1430 885.3012 892.4943 915.8992 923.3298 938.2032 966.1282 969.4020 985.0408 998.2990 1014.7327 1032.9876 1081.2302 1083.3021 1091.0746 1100.5924 1128.8471 1132.9249 1161.5905 1181.0562 1212.3446 1226.8299 1235.4801 1247.6819 1254.3676 1280.9437 1285.4522 1294.7874 1305.3153 1332.9030 1334.3660 1339.1219 1344.4297 1353.5599 1376.9020 1378.6289 1388.4466 1418.0579 1438.4317 1447.3532 1451.2858 1456.3549 1457.9226 1470.7817 1475.0259 1505.8120 1579.4700 1598.6891 1618.2648 1667.4628 2954.2750 2957.0391 2978.1979 2979.0895 3002.1042 3002.4313 3016.2467 3019.0470 3040.1097 3048.1541 3063.5256 3070.5215 3090.8841 3096.6589 3109.9656 3116.6655 3136.6839 3146.5092 3469.8214
redmass: 4.9169 5.8412 3.7770 3.9813 3.8981 2.8201 3.3467 1.0844 2.7703 3.0368 5.4093 2.9882 3.5108 1.3032 2.5498 2.4610 2.7272 2.4970 3.9742 2.8134 2.5051 3.5018 3.2720 3.5683 4.9567 3.2283 3.2045 4.4467 2.6986 4.1686 2.7961 3.9536 3.6951 1.5077 1.5643 1.7291 2.5508 1.9351 1.8853 2.7725 1.5625 2.7382 1.3505 1.9097 1.1524 2.3493 2.7449 1.7026 3.2314 1.8850 1.8309 3.3568 1.9106 1.1768 1.4453 1.4793 1.8062 1.3326 1.5369 1.3011 1.8628 1.2228 1.4659 1.4812 1.4479 1.4311 1.4614 1.4905 1.3896 1.6852 2.3803 1.2752 3.3358 3.2448 1.1359 1.0867 1.1282 1.0845 1.0535 1.0870 1.0939 2.6931 6.5127 7.3224 6.4738 6.0674 1.0644 1.0642 1.0653 1.0611 1.0414 1.0539 1.0937 1.0951 1.0984 1.1042 1.1025 1.0898 1.0965 1.0906 1.0881 1.0903 1.1010 1.0948 1.0686
irintensity: 0.6677 2.9755 2.2903 1.7375 0.7302 0.4079 4.7130 2.6874 1.0010 0.4736 2.5036 3.8180 9.2836 101.3504 17.8686 17.6593 2.0952 11.8705 7.4354 0.8376 6.6058 2.4348 5.6518 19.3175 2.2962 3.8088 6.2312 0.8479 1.4725 5.0677 0.7616 0.2272 0.9224 22.1778 13.4291 7.7098 5.7250 12.8277 10.2094 5.5364 4.9564 2.6233 8.7574 16.1736 53.0441 1.4714 27.7067 9.8027 2.9262 0.3949 2.1100 32.6598 2.0298 3.1156 0.1056 5.3498 1.9120 24.3410 11.7853 4.6872 21.1052 16.1586 75.3471 7.2493 8.2921 9.7407 1.0796 54.2022 2.2008 5.5789 101.4765 55.3955 27.6693 7.6005 38.1465 22.7650 1.2619 16.5328 17.3463 11.5428 11.5012 29.7369 10.7623 173.6473 1.1356 4.9448 32.2223 23.0426 42.5192 29.5508 12.8822 21.3099 59.4963 11.4560 82.4842 68.0364 4.4752 22.1194 12.0093 23.1059 21.8546 12.0320 10.1492 16.5032 7.6414
temp: 298.150 k
press: 1.00000 atm
elementType: 8 8 7 6 6 6 6 6 6 6 6 6 6 6 6 6 6 6 1 1 1 1 1 1 1 1 1 1 1 1 1 1 1 1 1 1 1
symmnumber: 1
zpe: 804804.1 jmol-1
zpe.correction: 0.306534 hartree
zpe.thermalcorrener: 0.324585 hartree
zpe.thermalcorrenthalpy: 0.325529 hartree
zpe.thermalcorrgfe: 0.258292 hartree
zpe.sumelectzpe: -786.808048 hartree
zpe.sumelectthermal: -786.789996 hartree
zpe.sumelectthermalent: -786.789052 hartree
zpe.sumelectthermalfe: -786.856290 hartree
dipole: 1.7795 -3.0054 1.9638
dipole: 4.0070
quadrupole: -99.5128 -97.1225 -111.9443
quadrupole: 14.9416 -12.0661 3.0785
quadrupole: 3.3471 5.7374 -9.0844 14.9416 -12.0661 3.0785
hfenergy: -787.1145813 hartree
pointgroup: C01 [X(C15H19N1O2)]
dipole: -0.7086354 -1.1355071 -0.832887 debye
polarizability: 287.7760131|4.7129624|165.920736|12.7605865|2.8966583|118.319266 unknown
InChI: InChI=1S/C15H19NO2/c1-12(17)16(18)10-4-5-13-8-9-14-6-2-3-7-15(14)11-13/h4-5,8-9,11,18H,2-3,6-7,10H2,1H3
charge 0 multiplicity 1
37 atoms
O  3.975792 -1.101972 -1.411681
O  5.382303 1.027997 1.122486
N  4.340962 -0.659451 -0.068311
C  -5.401648 -0.83579 -0.645632
C  -5.66984 0.535493 0.013008
C  -4.140564 -1.485414 -0.033369
C  -4.50234 1.504863 -0.275569
C  -2.9528 -0.527666 0.051862
C  -3.130142 0.881328 -0.034353
C  -1.649419 -1.04526 0.246652
C  -1.988868 1.718765 0.086124
C  -0.50508 -0.214011 0.368028
C  -0.701222 1.194623 0.284527
C  0.817599 -0.836842 0.570696
C  2.012027 -0.204145 0.742902
C  3.316187 -0.93292 0.972553
C  5.230973 0.423644 0.018191
C  5.999272 0.764321 -1.24924
H  -5.260984 -0.694361 -1.736282
H  -6.270229 -1.508582 -0.514456
H  -5.782146 0.396782 1.107236
H  -6.617545 0.968769 -0.358913
H  -3.851678 -2.385508 -0.610077
H  -4.384459 -1.841614 0.989865
H  -4.604263 2.423824 0.333864
H  -4.563027 1.83306 -1.33508
H  -1.518446 -2.135042 0.307945
H  -2.123452 2.806464 0.02344
H  0.151255 1.876701 0.373692
H  0.81785 -1.938557 0.586693
H  2.081394 0.891924 0.735406
H  3.790103 -0.597672 1.913988
H  3.155287 -2.025358 1.026941
H  6.656119 1.6192 -1.031221
H  5.307748 1.016282 -2.070998
H  6.613783 -0.088778 -1.588808
H  4.407798 -1.995296 -1.510107
