program: Gaussian 09
title: 000129314
version: EM64L-G09RevD.01
frameworkgroup: C1[X(C28H24O8)]
method: RPBEPBE
basis: SDD
operation: Freq
keyword: #pfreq=noraman
keyword: PBEPBE/SDD
title: #p freq=noraman PBEPBE/SDD
converged: YES YES NO NO
title: Mulliken charges:
elementType: O O O O O O O O C C C C C C C C C C C C C C C C C C C C C C C C C C C C H H H H H H H H H H H H H H H H H H H H H H H H
charge: -0.448886 -0.403060 -0.403592 -0.438295 -0.492512 -0.433548 -0.445793 -0.445159 -0.457648 -0.418136 -0.700623 0.426431 0.440680 0.189345 0.492077 -0.652527 0.575308 -0.627649 -0.577066 0.182425 -0.691635 0.636051 0.143594 0.145999 -0.598332 0.337873 -0.481678 -0.509430 -0.611294 -0.606286 0.167676 -0.325286 0.117063 0.354258 0.352903 -0.564162 0.299919 0.231029 0.225590 0.225516 0.232967 0.222085 0.233478 0.240012 0.237359 0.246115 0.250585 0.233573 0.251648 0.243276 0.248577 0.363386 0.354861 0.355207 0.358958 0.244996 0.376052 0.383240 0.357638 0.354847
chargesum: 0.00000
title: Mulliken charges with hydrogens summed into heavy atoms:
elementType: O O O O O O O O C C C C C C C C C C C C C C C C C C C C C C C C C C C C
charge: -0.085500 -0.048199 -0.048385 -0.079338 -0.116460 -0.050308 -0.088155 -0.090312 -0.157728 -0.187107 -0.249517 0.426431 0.440680 0.189345 0.492077 -0.197475 0.575308 -0.394170 -0.337054 0.182425 -0.454276 0.636051 0.143594 0.145999 -0.352217 0.337873 -0.231093 -0.275857 -0.359645 -0.363010 0.167676 -0.076709 0.117063 0.354258 0.352903 -0.319166
polarizability: 3.80769634e+02 1.64226040e+01 3.68239885e+02 4.69866642e+01 1.55779205e+01 2.51939148e+02
1716.lowfreq: -1.7854 -0.0005 -0.0002 0.0004 1.7850 5.4594 13.6290 17.2872 24.3080
frequency: 13.5301 17.2665 24.3006 28.0352 30.7861 39.6531 44.0802 62.3800 74.0521 95.8645 111.5004 133.7456 149.3473 182.1054 184.1182 207.2555 215.1093 218.1749 227.3307 233.4504 237.3409 243.8821 265.2956 279.4069 281.6017 287.3742 293.1068 306.5413 314.0823 326.3348 330.7718 337.1390 340.1859 350.5987 352.2017 357.1146 367.0463 369.2791 392.4994 424.0288 427.3311 433.7197 441.1880 459.9544 478.8413 489.1685 493.5860 496.8898 506.0886 511.0305 514.0462 540.7234 541.7369 556.1370 566.6036 584.1374 590.2568 595.2437 609.8240 611.5276 619.0541 630.1349 664.2602 674.5939 690.0072 706.1476 720.7833 728.2919 737.7291 747.2461 761.8711 790.5399 795.3144 815.9383 819.9438 823.6501 829.5733 840.6683 842.8349 844.8911 856.5161 867.0087 868.3227 911.3509 929.5910 933.2670 948.4645 963.2357 968.3778 975.1185 982.7538 995.0852 996.3780 1026.2593 1073.8904 1081.8406 1116.2300 1120.3531 1125.8366 1129.7767 1140.7320 1141.8894 1145.4844 1149.4005 1164.7723 1170.1595 1176.6905 1181.0608 1186.5671 1188.6183 1198.3182 1213.3087 1222.0052 1223.4192 1236.9683 1261.9514 1262.7222 1279.5195 1286.5299 1293.7100 1299.3526 1312.0091 1313.0978 1327.1577 1336.4062 1339.2210 1363.3886 1370.5145 1398.5452 1403.2377 1405.6916 1412.1287 1421.6925 1432.6708 1447.5641 1464.4120 1470.4395 1483.3606 1496.9607 1508.0983 1518.0652 1524.5579 1610.9698 1611.9530 1614.2553 1614.9713 1620.1726 1623.5534 1624.2739 1633.0240 2961.9632 3002.2366 3006.0928 3026.2387 3050.6969 3064.7333 3093.3809 3097.1422 3116.2039 3119.1579 3119.2543 3123.9545 3145.2237 3146.3917 3157.7239 3167.7746 3524.8718 3572.3652 3576.1876 3583.5172 3583.9776 3585.0278 3592.2076 3621.3114
redmass: 7.6151 7.0341 7.0669 5.1667 7.3976 5.9195 7.6387 5.7934 6.2743 6.6469 6.8459 6.2557 6.4188 6.4158 6.4870 6.1770 5.9275 5.3518 4.3205 4.0930 5.3927 5.3097 5.5812 4.9677 1.3092 2.5728 3.7178 3.5109 4.0505 1.4831 4.4418 1.6229 1.7427 1.1974 1.1397 1.1165 2.7712 1.1119 5.2674 4.3324 4.0994 4.3707 3.1872 4.5119 3.5005 1.2429 3.8090 3.4244 6.7724 6.1950 5.4949 4.6534 6.3767 5.9828 6.2526 4.0740 5.5290 4.5355 5.2279 3.3993 4.3174 4.3076 6.1353 4.8811 2.1508 3.4528 3.8255 3.5038 3.7726 4.6223 4.6909 3.3856 2.1213 1.4242 1.7856 1.6339 2.0974 1.9368 1.9389 1.9372 1.5461 1.7754 1.7836 3.7352 2.7396 1.3855 3.1212 4.7025 4.0973 3.7883 5.9765 3.7239 3.1107 3.3361 2.4563 2.9449 2.0773 2.0750 1.5259 1.5852 1.3746 1.3141 1.2948 1.3585 1.2941 1.4058 1.3425 1.4225 1.4294 1.2870 1.5822 1.5713 2.1510 1.4314 1.5041 1.6549 1.6093 1.4482 2.7783 1.5217 1.5012 2.0867 1.5553 2.2636 5.4017 1.6040 1.9212 1.9129 3.4841 5.6320 5.8396 4.0623 2.6666 3.9134 2.7929 2.6637 1.2140 1.1427 3.0974 3.2916 3.1699 3.4230 6.8424 6.6889 6.7356 6.7260 6.0436 6.5932 7.1382 6.4288 1.0818 1.0608 1.0597 1.0834 1.1015 1.1009 1.0897 1.0907 1.0914 1.0916 1.0896 1.0912 1.0925 1.0924 1.0923 1.0947 1.0648 1.0658 1.0661 1.0659 1.0660 1.0660 1.0661 1.0665
irintensity: 0.2897 0.1418 0.3867 1.7412 0.1208 0.3784 0.0713 0.0725 0.5164 0.9771 0.3268 0.4569 1.1622 2.7341 0.0174 0.1539 3.3338 0.3133 3.7251 2.8708 1.1819 0.1817 3.4233 6.9040 127.4196 9.5434 69.1897 4.9040 23.6724 55.9370 16.4816 39.8549 6.1202 117.7973 38.0396 301.5442 24.9989 129.6385 23.3445 2.9890 6.7193 2.7742 16.6422 2.9627 26.6399 86.3133 1.8349 10.7318 8.0760 8.1010 4.4197 1.5999 4.6662 6.5473 3.1329 18.5888 16.0086 3.5837 9.1135 26.3011 18.5759 2.4130 9.1816 4.3181 22.1088 6.7623 2.1249 7.8272 9.2231 10.8959 15.6958 6.1492 15.4994 19.5145 1.2165 3.4673 45.1740 5.1499 15.3394 35.6810 22.3639 30.6998 30.3253 27.3954 6.6827 2.2769 7.4781 17.9897 78.3594 36.1580 10.9334 4.6282 93.4585 41.4169 157.8876 45.4190 114.1585 43.8802 227.0744 39.8230 589.7753 62.8249 37.0195 62.9021 3.0722 108.7542 112.4051 51.4385 59.8512 40.9402 63.7973 19.4855 114.0593 12.0247 13.0395 29.1070 24.1101 17.4568 52.7163 41.0199 5.0410 37.8395 19.7747 15.7751 23.7940 32.5394 18.7385 7.3562 20.9323 7.9257 1.8518 21.5232 31.6891 52.5381 55.5729 46.5383 36.7829 13.2599 37.9659 22.1507 95.7031 126.6915 51.0833 108.4743 17.0910 85.6424 44.0979 115.4103 2.2748 152.6945 19.4358 18.2127 50.1999 0.4937 36.4665 12.6687 26.3250 6.3641 11.5076 9.0607 13.5036 2.1987 6.0702 3.5253 2.7679 9.5292 80.4429 34.0881 51.6452 42.6681 22.5301 42.8539 32.4206 37.3586
temp: 298.150 k
press: 1.00000 atm
elementType: 8 8 8 8 8 8 8 8 6 6 6 6 6 6 6 6 6 6 6 6 6 6 6 6 6 6 6 6 6 6 6 6 6 6 6 6 1 1 1 1 1 1 1 1 1 1 1 1 1 1 1 1 1 1 1 1 1 1 1 1
symmnumber: 1
zpe: 1198133.6 jmol-1
zpe.correction: 0.456345 hartree
zpe.thermalcorrener: 0.488908 hartree
zpe.thermalcorrenthalpy: 0.489852 hartree
zpe.thermalcorrgfe: 0.391521 hartree
zpe.sumelectzpe: -1680.590458 hartree
zpe.sumelectthermal: -1680.557895 hartree
zpe.sumelectthermalent: -1680.556951 hartree
zpe.sumelectthermalfe: -1680.655282 hartree
dipole: 1.2277 -2.5849 -0.2047
dipole: 2.8690
quadrupole: -216.7865 -223.0448 -187.4628
quadrupole: -1.6175 14.9246 2.2459
quadrupole: -7.6884 -13.9468 21.6352 -1.6175 14.9246 2.2459
hfenergy: -1681.0468032 hartree
pointgroup: C01 [X(C28H24O8)]
dipole: -0.4699901 -1.0236055 0.0734824 debye
polarizability: 381.2726848|-16.6155838|368.0373109|46.939789|-14.115869|251.6386717 unknown
InChI: InChI=1S/C28H24O8/c29-16-3-13(4-17(30)9-16)5-22-21-12-26(35)25(34)11-20(21)19(14-1-2-23(32)24(33)8-14)7-15-6-18(31)10-27(36)28(15)22/h1-4,6,8-12,19,22,29-36H,5,7H2
charge 0 multiplicity 1
60 atoms
O  -1.836705 -0.718559 -2.252151
O  0.591702 5.382527 -1.215229
O  2.916554 5.089995 0.168769
O  0.109855 -4.810707 -0.540472
O  4.270317 -1.355436 -2.453538
O  6.157361 -2.452092 -0.864515
O  -5.201802 -2.886363 0.83476
O  -6.663611 1.395085 -0.941658
C  -1.022555 0.836128 -0.06105
C  1.818163 0.469962 1.600151
C  0.702611 -0.544311 2.005114
C  0.12929 1.849686 0.08296
C  1.343884 1.702925 0.81165
C  -0.640412 -0.637349 -0.15765
C  0.114994 -1.313403 0.837041
C  -2.144135 1.096709 1.029818
C  2.990272 -0.259096 0.924918
C  -0.098885 3.089309 -0.584037
C  2.260198 2.793214 0.824094
C  -1.109613 -1.404706 -1.260201
C  0.372666 -2.7018 0.731766
C  -3.473553 0.44433 0.684316
C  0.80801 4.162378 -0.558864
C  2.02318 4.009266 0.163042
C  -0.857839 -2.788129 -1.382939
C  -0.113771 -3.432206 -0.375099
C  3.054115 -0.407607 -0.484218
C  4.006629 -0.848618 1.717085
C  -4.484554 1.198186 0.046016
C  -3.701796 -0.926634 0.970553
C  4.10311 -1.138493 -1.064491
C  5.064808 -1.581508 1.131176
C  5.116462 -1.73273 -0.266263
C  -4.923918 -1.527267 0.59492
C  -5.704361 0.580304 -0.311477
C  -5.940137 -0.786056 -0.046234
H  -1.514029 1.077059 -1.020085
H  2.207689 0.856232 2.565377
H  -0.077571 0.012139 2.556326
H  1.148729 -1.258326 2.721376
H  -2.275705 2.191754 1.104006
H  -1.794861 0.74965 2.018354
H  -1.028895 3.207484 -1.15835
H  3.205028 2.667657 1.371905
H  0.977258 -3.19737 1.501907
H  -1.218332 -3.371216 -2.237732
H  2.283364 0.055259 -1.112925
H  3.977484 -0.7325 2.80761
H  -4.34464 2.260108 -0.178287
H  -2.923259 -1.518262 1.468654
H  5.855787 -2.031881 1.73817
H  -2.230209 -1.350211 -2.902756
H  -0.283804 5.371416 -1.677027
H  3.729183 4.858011 0.684175
H  0.698541 -5.157356 0.174882
H  -6.878276 -1.283873 -0.316544
H  3.536971 -0.953712 -2.977618
H  6.0235 -2.439868 -1.849012
H  -4.421366 -3.330146 1.250366
H  -7.488326 0.882719 -1.131239
