program: Gaussian 09
title: 000129404
version: EM64L-G09RevD.01
frameworkgroup: C1[X(C24H26O8)]
method: RPBEPBE
basis: SDD
operation: Freq
keyword: #pfreq=noraman
keyword: PBEPBE/SDD
title: #p freq=noraman PBEPBE/SDD
converged: YES YES NO NO
title: Mulliken charges:
elementType: O O O O O O O O C C C C C C C C C C C C C C C C C C C C C C C C H H H H H H H H H H H H H H H H H H H H H H H H H H
charge: -0.191935 -0.286282 -0.203066 -0.259270 -0.263182 -0.312298 -0.291186 -0.308338 -0.249556 -0.311671 -0.475441 -0.267547 0.433120 -0.359237 0.393769 0.153251 0.632775 -0.540263 -0.568726 0.176228 0.156851 -0.675424 -0.558404 -0.205698 0.282099 0.266002 -0.205044 -0.016039 -0.702607 -0.529706 -0.524661 -0.524560 0.281916 0.298215 0.261381 0.216898 0.236148 0.240273 0.274007 0.267527 0.258784 0.314536 0.215961 0.185671 0.235339 0.243753 0.204704 0.221167 0.259591 0.222484 0.225747 0.255905 0.217679 0.260408 0.227995 0.232452 0.226070 0.251436
chargesum: 0.00000
title: Mulliken charges with hydrogens summed into heavy atoms:
elementType: O O O O O O O O C C C C C C C C C C C C C C C C C C C C C C C C
charge: -0.191935 -0.286282 -0.203066 -0.259270 -0.263182 -0.312298 -0.291186 -0.308338 0.032360 -0.013456 -0.214060 -0.050650 0.433120 0.117185 0.393769 0.153251 0.632775 -0.266256 -0.301199 0.176228 0.156851 -0.416639 -0.243868 0.195933 0.282099 0.266002 0.274048 -0.016039 -0.017145 0.174430 0.181421 0.185398
polarizability: 3.21468687e+02 -7.26839065e+00 2.66617748e+02 -1.36964339e+01 -9.10624466e+00 2.75851116e+02
1716.lowfreq: -9.6334 -6.9412 -0.0007 -0.0003 0.0005 4.4777 16.1884 22.5742 28.5798
frequency: 15.6342 22.5377 28.5569 48.0956 52.8868 58.3665 60.0610 76.8802 80.3664 85.4612 86.8372 93.4793 98.2374 106.8869 130.3626 143.3387 153.6356 156.6660 164.2461 178.0550 182.4523 195.0724 209.8060 216.3706 226.0958 239.9331 251.6665 256.0662 262.1810 283.5243 289.1732 314.7218 326.6903 358.0991 364.4515 376.3101 409.4489 424.4607 441.8593 456.1994 471.6086 512.9704 521.7270 547.3542 567.2432 586.8544 614.7959 623.9500 639.1532 649.4287 652.3108 676.8047 681.7141 691.1217 711.1014 728.2049 755.8589 772.4878 779.9619 786.9231 811.2319 820.6070 832.7414 838.2281 854.6076 867.3119 873.8368 881.1812 882.7806 901.9988 910.3560 938.9529 941.0964 945.3151 964.5685 972.5905 975.9959 999.6117 1012.3283 1032.9315 1036.8548 1046.8424 1059.8788 1070.6122 1091.2091 1109.4157 1110.6966 1113.0931 1114.1006 1116.4652 1125.8080 1139.8521 1146.9485 1151.3558 1155.7042 1158.5537 1162.0559 1173.2265 1183.8362 1192.0188 1215.3008 1220.5965 1229.9755 1234.2273 1250.9404 1258.7885 1278.9400 1284.7929 1294.2261 1312.1878 1319.4489 1321.3412 1340.5094 1359.0193 1362.4008 1366.4768 1370.3404 1400.8044 1404.7380 1417.0692 1419.1244 1429.7553 1434.5096 1441.9724 1454.9054 1457.3231 1460.7637 1464.6827 1466.8676 1472.5832 1476.4829 1481.9006 1483.6372 1485.2908 1486.1632 1487.1785 1494.3093 1571.4417 1605.1702 1619.4459 1622.1135 1697.0085 2921.4630 2931.0547 2972.0283 2975.9630 2976.9344 2988.5291 2995.2611 2998.9305 3004.6011 3018.1783 3028.8342 3070.8404 3071.2572 3076.3609 3082.9081 3086.0606 3095.7597 3103.0466 3110.9850 3119.0126 3119.3626 3126.2556 3134.9950 3148.2107 3153.9017 3164.5300
redmass: 4.9383 6.1992 5.9947 4.3755 4.2280 3.7299 2.7676 3.8091 2.9346 2.0035 2.2984 4.0101 3.6837 5.2645 3.5586 2.1389 1.3932 4.2421 1.7178 1.1272 4.4378 3.4468 3.7620 3.6795 4.8302 4.4716 1.9210 2.6232 4.7643 5.0404 5.1695 4.9135 4.5838 6.3461 5.3582 5.6378 5.7215 4.2898 5.4992 4.5683 5.8638 5.5630 4.7875 6.5822 5.3668 5.6655 6.4439 5.2870 4.7947 5.8282 7.4552 8.5816 5.8416 6.2604 5.5764 5.2428 4.8969 4.3121 4.4158 5.2025 3.8282 1.2828 2.8401 4.4027 5.4187 4.8995 1.5803 2.1013 1.6196 3.4753 2.6556 1.6488 6.4957 4.8476 4.4433 5.8907 4.8492 2.3648 4.2606 6.2136 3.4707 3.5263 2.7014 1.4837 3.9267 2.3004 1.2542 1.3379 1.2420 2.3151 1.0611 1.4974 1.8643 1.3529 1.4331 1.4510 2.2495 1.3728 1.9942 2.0916 1.3767 1.3134 1.4905 1.6934 1.1582 3.6118 1.2616 1.5222 5.2902 1.4165 1.4022 1.4140 1.4267 1.7980 1.6030 2.4429 1.3816 1.2568 1.5606 1.5305 2.8668 4.4430 1.2281 1.6673 1.2842 1.0627 1.0671 1.4662 1.2352 2.0540 1.0574 1.0586 1.0547 1.0857 1.0637 1.4139 1.0707 7.2626 6.7066 8.0871 8.9931 12.5615 1.0826 1.0614 1.0309 1.0310 1.0317 1.0359 1.0838 1.1010 1.0601 1.0639 1.0822 1.0855 1.1035 1.1054 1.0994 1.0992 1.1015 1.1059 1.1114 1.1032 1.1031 1.1044 1.0934 1.0920 1.0926 1.0929
irintensity: 0.4969 1.4909 1.4661 0.8444 0.1161 1.8797 2.2502 4.2011 2.7821 9.1847 10.3724 1.6749 2.5412 1.6618 1.2754 1.1874 2.0668 4.2665 2.3813 0.4394 3.9319 3.6804 7.1798 2.5879 3.6390 7.3129 12.2432 0.8694 0.2948 10.7067 3.8774 4.3848 1.6662 4.3892 1.4382 5.8590 4.9213 4.3696 6.4820 5.4217 1.3106 1.4089 0.6296 5.2890 6.0387 10.9698 6.4879 8.6231 7.0697 9.9830 0.7320 0.6232 14.6898 5.0780 5.3692 0.7066 5.2938 9.0215 16.1902 30.4087 15.0641 5.3933 4.9272 2.8539 60.5850 3.4574 2.5070 22.8208 42.6978 14.2274 11.0016 12.6677 66.3903 68.6995 35.1405 169.3510 18.8117 8.2330 72.1099 131.2891 144.3827 42.0863 43.7239 6.8669 143.7780 30.7816 10.4337 3.1414 2.9744 4.1215 0.2056 8.9222 10.7889 1.0574 4.1809 14.8605 13.9153 12.6136 23.0001 8.1569 20.0102 16.8602 15.5645 40.5073 2.2615 209.5931 2.7860 22.5127 126.2971 16.4604 9.8956 21.5048 7.3136 6.7824 6.7242 5.5599 3.0667 28.2171 35.3245 17.4729 10.5259 0.5186 22.8378 25.2231 57.9971 15.3760 1.7898 56.1747 17.4584 150.3530 3.9198 14.8495 12.6030 8.6542 25.2427 52.8416 5.3081 77.9196 58.4780 9.3280 0.2021 278.6829 45.0581 86.4253 70.3750 87.3675 65.1793 27.5034 7.1766 37.5208 123.6172 32.1701 14.9509 5.6209 25.6721 20.8287 30.6818 26.7455 27.8846 30.4266 29.5662 19.4289 28.8739 16.9121 39.4963 2.2096 4.7396 1.0715
temp: 298.150 k
press: 1.00000 atm
elementType: 8 8 8 8 8 8 8 8 6 6 6 6 6 6 6 6 6 6 6 6 6 6 6 6 6 6 6 6 6 6 6 6 1 1 1 1 1 1 1 1 1 1 1 1 1 1 1 1 1 1 1 1 1 1 1 1 1 1
symmnumber: 1
zpe: 1198320.6 jmol-1
zpe.correction: 0.456416 hartree
zpe.thermalcorrener: 0.487514 hartree
zpe.thermalcorrenthalpy: 0.488458 hartree
zpe.thermalcorrgfe: 0.392198 hartree
zpe.sumelectzpe: -1529.490097 hartree
zpe.sumelectthermal: -1529.458999 hartree
zpe.sumelectthermalent: -1529.458055 hartree
zpe.sumelectthermalfe: -1529.554315 hartree
dipole: -0.1828 3.9059 5.2475
dipole: 6.5441
quadrupole: -161.1772 -189.2473 -191.6462
quadrupole: -4.4683 -2.7626 -15.5060
quadrupole: 19.5131 -8.5571 -10.9560 -4.4683 -2.7626 -15.5060
hfenergy: -1529.9465136 hartree
pointgroup: C01 [X(C24H26O8)]
dipole: 0.4406764 1.4303105 -2.09497 debye
polarizability: 324.6974199|1.3155423|266.8057669|-7.0525142|10.7358675|272.4343641 unknown
InChI: InChI=1S/C24H26O8/c1-5-29-22-14-9-17-16(31-11-32-17)8-13(14)20(21-15(22)10-30-24(21)25)12-6-18(26-2)23(28-4)19(7-12)27-3/h6-9,15,20-22H,5,10-11H2,1-4H3
charge 0 multiplicity 1
58 atoms
O  2.205264 -3.641108 2.020546
O  1.52423 -1.326116 -2.128383
O  0.010429 -3.53899 2.765518
O  2.861395 3.49834 1.974827
O  4.501497 3.082925 0.272383
O  -2.582326 0.384627 -2.665845
O  -4.044025 1.194473 2.002783
O  -4.582407 1.396937 -0.842883
C  1.977516 -2.565141 -0.134671
C  0.681789 -2.313546 0.682483
C  0.393553 -0.831603 1.150652
C  2.459513 -1.376992 -0.974438
C  1.535233 0.149828 0.845522
C  3.008459 -3.011961 0.933369
C  2.505121 -0.092518 -0.164805
C  0.859133 -3.214554 1.920824
C  -0.944295 -0.297016 0.60781
C  1.586122 1.351812 1.611456
C  3.544886 0.850289 -0.425654
C  2.596619 2.266954 1.32659
C  3.561204 2.022703 0.324742
C  -1.938247 0.146397 1.507574
C  -1.194214 -0.239443 -0.78482
C  1.905317 -0.355969 -3.175109
C  -2.408173 0.286986 -1.261537
C  -3.156913 0.69029 1.035253
C  3.959002 4.123116 1.188098
C  -3.390714 0.79476 -0.363492
C  0.90965 -0.511774 -4.325143
C  -3.739323 -0.367882 -3.205196
C  -5.45005 0.736943 1.930764
C  -4.354897 2.728486 -1.458042
H  1.790094 -3.405822 -0.826902
H  -0.203501 -2.669665 0.133138
H  0.281984 -0.85353 2.25171
H  3.476547 -1.587708 -1.378583
H  3.713409 -3.777442 0.574143
H  3.562172 -2.1632 1.373398
H  0.848459 1.55185 2.393713
H  4.306197 0.651503 -1.186008
H  -1.796718 0.079589 2.591497
H  -0.450791 -0.605837 -1.500561
H  1.88059 0.67369 -2.763878
H  2.945405 -0.573014 -3.506924
H  3.542719 4.952008 0.585548
H  4.754974 4.445078 1.876664
H  1.171072 0.178829 -5.147971
H  0.925858 -1.54383 -4.716527
H  -0.115981 -0.277479 -3.989276
H  -3.603197 -1.45139 -3.026143
H  -3.741606 -0.164275 -4.287082
H  -4.681207 -0.023656 -2.74294
H  -5.500073 -0.357206 2.09107
H  -5.900411 1.001135 0.959877
H  -5.961192 1.258412 2.754358
H  -3.945756 3.42771 -0.705694
H  -5.345078 3.071748 -1.795377
H  -3.663017 2.641351 -2.31522
