program: Gaussian 09
title: 000129215
version: EM64L-G09RevD.01
frameworkgroup: C1[X(C14H20O3)]
method: RPBEPBE
basis: SDD
operation: Freq
keyword: #pfreq=noraman
keyword: PBEPBE/SDD
title: #p freq=noraman PBEPBE/SDD
converged: YES YES NO NO
title: Mulliken charges:
elementType: O O O C C C C C C C C C C C C C C H H H H H H H H H H H H H H H H H H H H
charge: -0.443800 -0.270677 -0.265355 0.315896 -0.074438 -0.481299 -0.761876 -0.723231 -0.746533 -0.560759 0.561171 -0.511559 -0.441544 0.191873 0.159498 -0.331401 -0.204444 0.208495 0.230060 0.221218 0.223399 0.205555 0.222783 0.204634 0.205292 0.243831 0.215204 0.212648 0.217361 0.237787 0.204351 0.323829 0.255644 0.238997 0.247709 0.238896 0.230782
chargesum: 0.00000
title: Mulliken charges with hydrogens summed into heavy atoms:
elementType: O O O C C C C C C C C C C C C C C
charge: -0.119971 -0.270677 -0.265355 0.315896 0.134057 -0.030022 -0.110138 -0.069475 -0.101319 -0.118621 0.561171 -0.255915 -0.202546 0.191873 0.159498 -0.083692 0.265235
polarizability: 2.12981142e+02 1.24227225e+01 1.51590158e+02 1.37220848e+01 -1.00987372e+01 1.16873594e+02
1716.lowfreq: -8.2865 0.0004 0.0005 0.0007 2.1364 5.9316 15.3501 26.3711 42.4066
frequency: 14.6951 26.2429 42.3699 72.3821 80.3957 89.4483 143.6682 174.9636 206.4903 218.1289 235.2714 244.3760 260.8615 275.0920 278.8918 314.2649 323.7307 340.8161 369.2809 375.7859 413.7249 427.8940 449.4385 472.5380 521.7529 540.5813 593.9057 625.8335 676.1535 718.3310 726.7206 767.4788 771.3287 780.9633 817.9020 838.0342 856.0251 874.6510 911.8302 920.4363 924.9848 931.5991 934.6968 942.6662 974.3355 996.3887 1003.6224 1021.0066 1040.9664 1056.6174 1071.2159 1077.3666 1111.5761 1126.3899 1134.4801 1181.7284 1183.6436 1220.1317 1242.4180 1245.9817 1248.1800 1269.7872 1275.8923 1292.4369 1321.3105 1345.5753 1360.0190 1363.3687 1370.4798 1374.8771 1396.2645 1400.8406 1439.1648 1457.5713 1458.6919 1464.9462 1470.6550 1474.8420 1481.2950 1481.9446 1486.0802 1488.5620 1497.0701 1611.3993 1629.8464 2965.2190 2968.4746 2972.5945 2975.3513 2982.9361 2996.2152 3004.1191 3035.6932 3056.2645 3059.5938 3060.5234 3064.5328 3068.8007 3072.7134 3091.0535 3102.9299 3136.1821 3157.2723 3178.6716 3543.8154
redmass: 4.0799 3.5496 4.2866 2.7908 3.0695 2.5702 3.9632 4.6873 1.1579 4.0831 1.5877 1.0734 2.5252 2.1430 2.5692 1.9390 1.7039 2.1771 2.9151 2.4149 3.4182 3.1756 3.0292 3.9341 3.7302 2.6878 5.5667 4.2909 9.1071 4.2344 4.5243 3.9926 1.6250 3.1396 1.4356 8.3940 2.4765 1.5449 3.5562 1.8858 1.6393 1.4395 1.5853 1.3455 5.3441 1.8170 1.6959 1.5334 2.5970 3.6211 1.4942 2.4836 1.2856 1.0606 1.2479 1.7039 1.7323 2.3064 1.8245 2.1823 3.5840 1.4171 1.7985 1.2537 1.4176 1.5020 1.1787 1.2660 1.2056 1.2032 3.8745 1.2107 4.6303 1.0910 1.0579 1.0523 1.0743 2.0990 1.0914 1.0607 1.3236 1.0546 1.0613 7.8501 8.3390 1.0366 1.0368 1.0564 1.0415 1.0630 1.0607 1.0835 1.0956 1.0993 1.1009 1.0990 1.0995 1.0983 1.0986 1.0987 1.1104 1.0899 1.0928 1.0955 1.0654
irintensity: 0.2616 0.0885 0.6342 6.7360 9.5373 0.3217 1.4253 1.0096 1.9560 0.0651 4.9235 3.0616 3.1917 6.1296 1.0047 55.9824 102.3402 10.4066 4.9047 3.2212 5.2010 3.3795 4.4003 23.5477 2.7954 1.7536 2.0374 12.2759 0.6167 2.4477 6.9182 5.3306 9.2080 6.9848 37.1993 35.0551 14.6398 15.1239 26.9426 11.0783 1.9503 0.5234 4.0237 1.4965 152.2246 4.6468 9.4655 31.4550 3.6992 7.0633 5.4011 26.6234 14.6934 0.2224 15.5738 47.1036 8.5598 7.8990 42.8421 55.8118 97.8778 9.1519 9.7385 0.8938 4.7519 6.4301 18.2427 0.5614 25.5207 33.4274 12.0671 16.0900 43.5502 1.3572 2.6950 1.9042 11.4690 124.8833 7.3636 9.6600 28.5220 11.0646 29.4563 5.7542 1.4281 37.3222 20.7443 7.7073 27.0981 33.0558 133.3706 31.7946 7.6243 19.3693 29.1795 4.6348 46.6609 59.4949 81.4769 25.1963 32.7769 10.9925 4.7189 5.3719 4.2462
temp: 298.150 k
press: 1.00000 atm
elementType: 8 8 8 6 6 6 6 6 6 6 6 6 6 6 6 6 6 1 1 1 1 1 1 1 1 1 1 1 1 1 1 1 1 1 1 1 1
symmnumber: 1
zpe: 814468.8 jmol-1
zpe.correction: 0.310215 hartree
zpe.thermalcorrener: 0.328110 hartree
zpe.thermalcorrenthalpy: 0.329054 hartree
zpe.thermalcorrgfe: 0.262811 hartree
zpe.sumelectzpe: -769.819042 hartree
zpe.sumelectthermal: -769.801147 hartree
zpe.sumelectthermalent: -769.800203 hartree
zpe.sumelectthermalfe: -769.866446 hartree
dipole: 0.1473 1.1284 0.9853
dipole: 1.5052
quadrupole: -99.2549 -102.9625 -103.9058
quadrupole: -0.8992 -5.1444 -4.2393
quadrupole: 2.7862 -0.9214 -1.8648 -0.8992 -5.1444 -4.2393
hfenergy: -770.1292569 hartree
pointgroup: C01 [X(C14H20O3)]
dipole: -0.0534075 -0.3905333 0.4419759 debye
polarizability: 212.7162853|11.0917353|153.7972807|-15.4794452|5.141822|114.9313282 unknown
InChI: InChI=1S/C14H20O3/c1-14(2,3)13(15)7-5-10-4-6-11-12(8-10)17-9-16-11/h4,6,8,13,15H,5,7,9H2,1-3H3
charge 0 multiplicity 1
37 atoms
O  3.384665 1.696053 -0.564654
O  -3.72337 -1.788795 -0.0612
O  -4.784647 0.18287 0.803859
C  4.160352 -0.51309 0.370563
C  3.083456 0.243899 -0.485293
C  1.61448 0.046223 -0.050041
C  4.180915 0.002517 1.834767
C  5.548936 -0.266695 -0.279081
C  3.866251 -2.03773 0.361718
C  0.614601 0.639814 -1.081563
C  -0.828643 0.578173 -0.602189
C  -1.535645 -0.66332 -0.633103
C  -1.470537 1.735399 -0.091775
C  -2.845197 -0.675576 -0.153159
C  -3.470149 0.48375 0.354009
C  -2.806185 1.710055 0.40054
C  -5.027244 -1.217612 0.369306
H  3.198127 -0.085455 -1.53721
H  1.398681 -1.030251 0.08278
H  1.445782 0.526518 0.935611
H  3.203677 -0.126134 2.336256
H  4.465787 1.071376 1.88703
H  4.931124 -0.558276 2.422148
H  6.352225 -0.713468 0.336405
H  5.598514 -0.722584 -1.286442
H  5.741454 0.814444 -0.388467
H  2.974568 -2.296364 0.960968
H  3.708864 -2.409398 -0.66941
H  4.724731 -2.589548 0.787786
H  0.907334 1.685225 -1.288746
H  0.725446 0.082955 -2.033687
H  3.217534 2.088937 0.330649
H  -1.069436 -1.572097 -1.026049
H  -0.922854 2.684509 -0.082166
H  -3.292234 2.607349 0.791993
H  -5.407432 -1.79777 1.224409
H  -5.720333 -1.2131 -0.493461
