program: Gaussian 09
title: 000129186
version: EM64L-G09RevD.01
frameworkgroup: C1[X(C19H24O2)]
method: RPBEPBE
basis: SDD
operation: Freq
keyword: #pfreq=noraman
keyword: PBEPBE/SDD
title: #p freq=noraman PBEPBE/SDD
converged: YES YES NO NO
title: Mulliken charges:
elementType: O O C C C C C C C C C C C C C C C C C C C H H H H H H H H H H H H H H H H H H H H H H H H
charge: -0.174903 -0.236163 -0.158521 0.292992 -0.223123 -0.503374 -0.523991 0.309629 -0.545611 -0.620796 0.050845 -0.513028 -0.176238 -0.790357 0.008427 0.407982 -0.486700 -0.539107 -0.816607 -0.540266 0.171704 0.244464 0.236876 0.228294 0.232021 0.215138 0.236830 0.221740 0.230591 0.226761 0.222999 0.232153 0.249397 0.251145 0.229455 0.230475 0.244357 0.225730 0.206297 0.246382 0.230797 0.260245 0.227131 0.240128 0.237803
chargesum: 0.00000
title: Mulliken charges with hydrogens summed into heavy atoms:
elementType: O O C C C C C C C C C C C C C C C C C C C
charge: -0.174903 -0.236163 0.085942 0.292992 0.013753 -0.043059 -0.072023 0.309629 -0.093280 -0.171036 0.050845 -0.012487 0.055915 -0.086070 0.008427 0.407982 -0.054673 -0.061929 -0.111545 -0.280021 0.171704
polarizability: 2.99755071e+02 6.89638476e+00 1.90525304e+02 1.95565041e+01 -2.57553432e+00 1.50856451e+02
1716.lowfreq: -7.6080 -0.5003 -0.0005 -0.0002 0.0003 13.3889 29.9674 52.0762 61.7745
frequency: 29.8954 52.0405 61.7631 97.2609 113.0807 120.7392 144.7414 166.8965 167.6763 180.1107 207.5813 222.2220 258.5460 270.2019 274.4787 295.8476 326.9485 335.5368 371.1138 383.0692 393.7170 419.4485 447.9715 470.2567 482.8077 497.6328 519.2937 538.6895 549.0810 571.8167 581.9450 616.1671 635.1171 669.3922 680.6808 696.8609 744.4599 767.2523 812.5906 822.9837 848.8661 853.8591 879.3940 887.5559 903.5551 929.8976 934.0522 963.5093 973.9476 980.8672 988.5187 1011.3958 1019.2015 1031.6102 1032.7561 1036.0654 1058.1914 1075.6802 1079.5224 1096.3793 1113.4512 1128.1160 1130.5259 1135.3510 1156.8363 1172.3046 1180.8939 1190.7521 1203.5203 1217.4802 1231.0628 1236.4243 1257.4378 1260.4686 1268.1698 1271.2435 1287.2061 1290.2609 1293.4129 1304.6883 1314.9817 1320.4576 1326.7599 1332.4972 1341.6358 1352.8526 1362.2584 1382.2502 1385.2322 1402.5495 1428.7718 1449.0625 1454.7689 1465.6263 1466.3509 1469.0818 1473.2580 1473.6259 1481.2830 1489.2080 1492.2212 1568.8519 1598.7746 1607.4712 1656.1297 2913.1852 2930.0176 2941.6679 2952.5290 2971.2515 2977.2147 2981.1558 2985.7038 2988.2872 2991.0153 2999.5239 3004.9549 3034.7574 3038.1770 3053.8750 3054.8095 3058.3899 3069.0255 3072.9404 3073.8615 3081.8134 3086.3319 3116.5143 3144.8201
redmass: 6.2066 3.1599 5.1878 3.0489 1.7039 1.9325 2.9522 2.3219 2.4836 2.7403 3.3648 1.2725 2.6091 2.6252 3.2899 3.9137 3.1120 2.6704 2.7648 3.2633 2.6712 3.6503 4.1744 3.1110 3.4870 2.9169 3.6536 3.1589 2.3785 3.3370 4.2145 3.1974 3.7972 3.2295 3.2060 2.9606 2.5297 2.3144 2.0881 1.7687 2.4801 2.7510 2.3688 1.4827 2.5076 1.9246 1.9308 2.0239 2.3008 2.1608 1.8429 2.1836 2.0928 1.9434 2.2326 1.5553 2.2017 2.2168 2.0730 2.5114 1.8017 1.6278 1.6736 1.6758 1.4316 1.9649 1.8533 1.5778 1.6730 1.8671 1.5050 2.2973 1.4827 1.6466 1.4436 2.2893 1.5530 1.4445 1.5124 1.4909 1.4383 1.4928 1.4429 1.4520 1.6252 1.7093 1.3951 1.8823 1.2791 1.2222 1.0795 1.0831 1.0764 1.0890 1.0831 1.0890 1.0587 1.0813 1.0802 1.0643 1.0714 9.9949 7.2414 6.7818 12.0640 1.0788 1.0835 1.0804 1.0701 1.0609 1.0659 1.0417 1.0619 1.0376 1.0585 1.0595 1.0660 1.1021 1.1010 1.0966 1.1010 1.0984 1.0960 1.0985 1.0927 1.0990 1.0990 1.0936 1.0902
irintensity: 2.9999 0.8798 3.1357 3.8812 0.8803 1.5352 0.9325 1.8135 1.1833 0.5464 1.2428 0.5714 0.1040 1.3300 4.7461 1.0838 0.0873 0.1568 3.7255 0.9293 1.0221 8.8536 1.7478 1.7444 3.9573 1.1380 1.1650 0.4446 1.3803 3.6055 3.8689 0.9384 0.5419 9.6525 2.4394 1.1164 6.6468 3.6426 10.9617 3.9328 5.4086 7.3006 9.0562 20.9924 0.4036 4.6936 2.7277 7.2363 4.2984 16.3993 3.8729 23.8740 5.5516 16.2885 4.8010 8.1223 14.5228 2.7368 10.9217 14.1015 6.1330 0.7509 19.4548 5.5331 30.9243 3.1978 5.0305 16.8871 5.1380 7.5139 4.8027 23.1153 8.2152 1.6453 11.6475 96.9903 5.6086 1.3524 1.1785 1.9104 12.3325 22.4505 1.5205 1.3604 3.4684 13.9562 3.4744 13.2591 19.2837 16.5171 18.2767 14.4790 4.3086 6.7430 8.9596 16.7185 6.0023 8.9463 19.5098 8.5215 16.6873 174.7960 338.9278 5.9594 195.4397 0.3511 32.6254 8.8683 22.9433 26.5071 14.6927 22.4872 46.3554 25.2148 20.6016 28.9755 13.8480 27.8933 44.1541 10.7591 34.9962 8.6384 29.5497 36.3768 30.0728 18.6779 31.6788 26.4146 6.8083
temp: 298.150 k
press: 1.00000 atm
elementType: 8 8 6 6 6 6 6 6 6 6 6 6 6 6 6 6 6 6 6 6 6 1 1 1 1 1 1 1 1 1 1 1 1 1 1 1 1 1 1 1 1 1 1 1 1
symmnumber: 1
zpe: 1008034.0 jmol-1
zpe.correction: 0.383940 hartree
zpe.thermalcorrener: 0.403056 hartree
zpe.thermalcorrenthalpy: 0.404000 hartree
zpe.thermalcorrgfe: 0.337390 hartree
zpe.sumelectzpe: -887.287966 hartree
zpe.sumelectthermal: -887.268850 hartree
zpe.sumelectthermalent: -887.267906 hartree
zpe.sumelectthermalfe: -887.334516 hartree
dipole: 2.8863 -1.4007 3.4540
dipole: 4.7141
quadrupole: -181.3382 -115.0552 -126.8589
quadrupole: -2.3118 -1.6291 0.3744
quadrupole: -40.2541 26.0289 14.2252 -2.3118 -1.6291 0.3744
hfenergy: -887.6719063 hartree
pointgroup: C01 [X(C19H24O2)]
dipole: 1.1349658 -0.4541662 1.3947718 debye
polarizability: 299.6956376|8.4005653|190.0056461|19.175019|-5.2496553|151.4355431 unknown
InChI: InChI=1S/C19H24O2/c1-11-14-7-8-19(2)17(5-6-18(19)21)16(14)9-12-3-4-13(20)10-15(11)12/h10,12,16-17H,3-9H2,1-2H3
charge 0 multiplicity 1
45 atoms
O  5.058303 0.010569 -1.242937
O  -5.55044 -0.16088 -1.195319
C  1.738312 -0.672233 -0.1012
C  2.97357 0.249489 0.112316
C  0.514283 -0.25635 0.750168
C  2.611761 1.674311 -0.345655
C  2.310247 -2.110842 0.010325
C  0.154179 1.203141 0.387318
C  -0.657721 -1.251507 0.576399
C  1.338894 2.169886 0.407981
C  4.045171 -0.497902 -0.707796
C  3.661295 -1.99601 -0.754885
C  -1.970931 -0.601557 1.073341
C  3.518579 0.249693 1.576733
C  -1.137343 1.583026 0.06235
C  -2.238667 0.596078 0.168953
C  -3.181205 -1.557662 1.222059
C  -4.01236 -1.705942 -0.070286
C  -1.517819 2.968971 -0.443114
C  -3.43463 0.739227 -0.504678
C  -4.43574 -0.337458 -0.609153
H  1.433317 -0.537573 -1.165211
H  0.81514 -0.275317 1.822451
H  2.418081 1.672073 -1.435879
H  3.447505 2.375318 -0.165518
H  2.474489 -2.393882 1.067163
H  1.643333 -2.869152 -0.433801
H  -0.445038 -2.176154 1.146146
H  -0.757929 -1.537503 -0.49021
H  1.059681 3.156967 0.00721
H  1.613196 2.345007 1.470811
H  -1.749637 -0.192319 2.083034
H  4.477729 -2.616838 -0.344195
H  3.553656 -2.284074 -1.818678
H  2.788334 0.677549 2.285093
H  3.770006 -0.765365 1.93248
H  4.438296 0.859858 1.622083
H  -3.847918 -1.16514 2.014574
H  -2.828566 -2.548895 1.566743
H  -4.915569 -2.31871 0.093999
H  -3.417426 -2.208474 -0.860766
H  -3.658892 1.639262 -1.088102
H  -0.706759 3.703755 -0.33874
H  -2.395837 3.357744 0.104265
H  -1.795234 2.935416 -1.514569
