program: Gaussian 09
title: 000129159
version: EM64L-G09RevD.01
frameworkgroup: C1[X(C10H11N3O2)]
method: RPBEPBE
basis: SDD
operation: Freq
keyword: #p
keyword: freq=noraman
keyword: PBEPBE/SDD
title: #p freq=noraman PBEPBE/SDD
converged: YES YES NO NO
title: Mulliken charges:
elementType: O O N N N C C C C C C C C C C H H H H H H H H H H H
charge: -0.445475 -0.266175 -0.490311 -0.446978 -0.158051 -0.365863 -0.456268 0.290055 0.458746 -0.443977 -0.324317 0.265198 -0.343072 -0.340032 0.099478 0.226277 0.226474 0.229187 0.228935 0.290547 0.296838 0.218138 0.332187 0.268466 0.270403 0.379593
chargesum: 0.00000
title: Mulliken charges with hydrogens summed into heavy atoms:
elementType: O O N N N C C C C C C C C C C
charge: -0.065883 -0.266175 -0.199765 -0.150140 -0.158051 0.086887 0.001854 0.290055 0.458746 -0.225839 0.007870 0.265198 -0.074606 -0.069628 0.099478
polarizability: 2.52391373e+02 -6.03609194e-01 1.35921702e+02 4.18412628e-02 2.17834999e-02 6.23660274e+01
1716.lowfreq: -169.0780 -3.2322 -0.0008 -0.0006 -0.0005 6.2409 14.9747 43.9971 50.8303
frequency: -169.0682 43.9684 50.7585 83.8941 94.7439 100.7619 127.1954 188.7031 245.6791 258.5071 302.3548 313.4372 417.6850 429.0158 486.9062 490.7055 532.2232 579.8988 590.9192 627.3578 647.1028 688.0929 710.4806 736.5665 759.4797 760.4651 828.0072 835.3576 839.6103 887.5650 900.8823 945.6940 977.2410 995.8402 1017.9936 1018.6442 1032.3339 1074.0091 1084.2769 1122.8838 1152.2363 1174.5228 1194.5611 1211.9899 1217.7449 1272.6881 1276.3719 1306.8130 1316.5786 1322.4696 1378.5446 1428.5650 1442.4022 1479.1074 1501.2824 1508.4592 1539.0154 1592.1895 1614.3663 1635.0155 1639.3480 2975.6549 3004.2258 3020.3339 3056.4594 3111.7218 3157.2479 3160.9141 3176.0259 3534.0801 3554.5151 3608.1522
redmass: 1.3402 5.9636 5.9259 3.8002 5.6861 2.3492 2.9752 6.6123 3.9638 7.1636 4.0105 5.3247 2.9877 6.0974 6.8080 1.7500 1.5495 1.2348 5.0580 7.0359 7.5530 3.8365 5.7051 5.9070 4.5517 6.4809 1.1806 1.4503 5.8262 1.4463 4.5025 4.3853 1.3566 4.9490 1.3148 2.7988 3.7699 4.4396 1.5966 1.3445 1.5973 1.1194 1.1891 1.0850 1.6413 1.5717 1.9014 1.2966 1.4227 3.3168 3.3200 2.9797 2.8450 1.0978 1.3978 1.8119 3.4418 4.0633 4.4048 6.1733 8.0436 1.0568 1.0599 1.1090 1.1073 1.0897 1.0912 1.0948 1.0961 1.0641 1.0760 1.0802
irintensity: 85.6106 2.1563 5.5732 0.2451 2.9369 7.2926 8.6602 0.2199 5.7804 0.6557 4.3516 1.7176 2.8927 29.0949 6.5318 164.2427 22.5423 86.6994 32.2833 0.6519 7.0037 69.7775 4.4658 0.3707 19.3869 3.3080 0.3503 33.3783 1.0745 45.7592 10.5332 15.4968 0.4732 181.5867 2.6070 116.0667 72.0484 73.0210 0.0961 21.5846 186.8947 1.5244 3.5593 0.2031 16.6000 87.8485 7.2516 17.2857 34.8007 205.2580 31.9294 55.0562 37.9403 7.2283 23.9828 24.4209 830.6381 231.3937 494.1646 123.9749 193.1728 80.3836 106.6269 14.3247 59.0051 18.6954 15.6236 4.9284 4.5309 48.4342 19.4057 22.2063
temp: 298.150 k
press: 1.00000 atm
elementType: 8 8 7 7 7 6 6 6 6 6 6 6 6 6 6 1 1 1 1 1 1 1 1 1 1 1
symmnumber: 1
zpe: 528694.7 jmol-1
zpe.correction: 0.201369 hartree
zpe.thermalcorrener: 0.214357 hartree
zpe.thermalcorrenthalpy: 0.215301 hartree
zpe.thermalcorrgfe: 0.160552 hartree
zpe.sumelectzpe: -701.287043 hartree
zpe.sumelectthermal: -701.274056 hartree
zpe.sumelectthermalent: -701.273111 hartree
zpe.sumelectthermalfe: -701.327860 hartree
dipole: -6.0939 2.2464 -0.0257
dipole: 6.4948
quadrupole: -75.8712 -77.2245 -90.9966
quadrupole: -15.3654 0.0945 -0.0141
quadrupole: 5.4929 4.1396 -9.6325 -15.3654 0.0945 -0.0141
hfenergy: -701.4884125 hartree
pointgroup: C01 [X(C10H11N3O2)]
dipole: -2.3914322 -0.9002185 0.0023245 debye
dipolederiv: -0.5690135 -0.3299807 0.0032563 -0.6993866 -1.1927289 0.0046252 0.0085562 0.0079963 -0.4298348 -1.3984986 0.2256241 -0.0118977 0.3154592 -0.7014531 0.0076005 -0.0126084 0.0066443 -0.3441958 -1.2616676 -0.2657544 -0.0039122 0.0107445 -0.5130775 -0.0058823 -0.010696 -0.0096711 -0.5412188 -2.4568131 0.1832589 -0.0213024 0.1787208 -0.3536301 0.0065786 -0.0182726 0.0086919 -0.3302513 -0.7778323 0.0296204 -0.0034855 0.3632084 -0.9330662 0.0125632 -0.0111981 0.0109736 -0.3809131 0.4011595 -0.1168508 0.004382 -0.4397333 0.0215199 0.0012028 0.0119443 0.0039398 0.3717345 0.4153149 -0.1992013 0.0040621 -0.1341846 0.3178243 -0.0008956 0.004236 -0.0012697 0.2814215 2.3421418 0.1142276 0.0175627 -0.642675 1.1993425 -0.023261 0.0254267 -0.0173129 0.2054094 1.9466532 0.0627535 0.0148539 0.6218466 0.125408 0.0051433 0.0064634 0.0003012 0.1233197 -0.7208613 0.0189845 -0.0049962 0.3053511 0.0805284 -0.0019089 -0.0084988 -0.0043801 -0.2227104 -0.5768238 -0.095039 -0.0024017 -0.6041249 -0.1474327 -0.005449 0.0035169 -0.0011899 -0.1712971 -1.2703784 -0.1510907 -0.0084118 -0.2509341 -0.1933124 0.0001217 -0.0061746 0.0012785 -0.0244819 0.3952531 0.0308853 0.0039114 0.3206808 0.112318 -0.0002397 -0.0001312 -0.0028022 -0.1039187 0.5606217 0.077671 0.0042997 -0.0889514 0.0823988 -0.0032627 0.0063063 -0.0023418 -0.1027198 2.4925198 0.1926089 0.0161872 0.4419766 1.4580724 -0.0133089 0.0119963 -0.0155069 0.2259974 -0.1390247 -0.000436 0.1000984 0.0235567 0.0766488 0.0255833 0.1887118 0.0222629 -0.0868855 -0.1326148 -0.0035683 -0.1007731 0.019684 0.073988 -0.0304546 -0.1916419 -0.0271192 -0.0928473 -0.0434422 0.0812798 -0.0356477 0.0351448 -0.0232996 0.0916577 -0.1097389 0.1469962 -0.0646769 -0.0478774 0.0847606 0.0329145 0.0391258 -0.0305087 -0.0922426 0.1094068 -0.1478874 -0.0570771 0.1457673 0.0258586 -0.0028368 0.0417337 0.0843228 0.0091747 -0.0004206 0.011155 0.3953857 0.1153012 0.0074006 -0.002246 0.0191288 0.1227371 0.0018879 -0.0025917 -0.000938 0.3103663 0.0275752 -0.1053978 0.0003298 -0.0792412 -0.0996393 0.0030849 -0.0000453 0.002966 0.1670856 0.247327 0.0325589 0.0006576 0.0323733 0.0731609 0.0015212 0.0011535 0.0015137 0.1703657 0.0536574 0.089035 -0.0021059 0.0545215 0.0377776 0.0020939 -0.0017889 0.0023669 0.1548488 0.1092514 -0.0270815 0.0000028 -0.0368512 -0.0130015 0.0019581 0.0002075 0.0021847 0.1511629 0.1423039 0.0378729 -0.0025015 0.1528258 0.3351026 0.0021084 -0.0041187 0.0011482 0.3959309 unknown
polarizability: 252.3631081|1.423704|135.9193913|1.644128|-1.0846969|62.3966029 unknown
InChI: InChI=1S/C10H11N3O2/c14-9(15)7-1-3-8(4-2-7)13-10-11-5-6-12-10/h1-4,11,13-14H,5-6H2
charge 0 multiplicity 1
26 atoms
O  4.279978 1.69173 0.024421
O  4.93723 -0.535196 0.060247
N  -3.946864 -0.886637 -0.008591
N  -1.556378 -1.050288 0.014772
N  -2.72809 1.073916 -0.034798
C  -5.021147 0.126854 -0.038992
C  -4.175612 1.462214 -0.050331
C  -2.697759 -0.244722 -0.009879
C  -0.203909 -0.650415 0.020145
C  0.786055 -1.677828 0.042468
C  0.198118 0.71552 0.005228
C  2.556997 0.012195 0.033871
C  2.147783 -1.349046 0.049193
C  1.567627 1.03068 0.012274
C  4.004044 0.308949 0.041442
H  -5.673919 0.055018 0.851516
H  -5.650402 0.025194 -0.943519
H  -4.384893 2.06617 -0.951493
H  -4.397067 2.089276 0.832195
H  -4.114415 -1.889184 0.021772
H  -1.715678 -2.058369 0.019716
H  0.479025 -2.731928 0.055076
H  -0.575004 1.487529 -0.011343
H  2.915812 -2.129041 0.066377
H  1.88558 2.077072 -0.000014
H  5.267287 1.809438 0.030546
