program: Gaussian 09
title: 000129210
version: EM64L-G09RevD.01
frameworkgroup: C1[X(C19H25N3O)]
method: RPBEPBE
basis: SDD
operation: Freq
keyword: #p
keyword: freq=noraman
keyword: PBEPBE/SDD
title: #p freq=noraman PBEPBE/SDD
converged: YES YES NO NO
title: Mulliken charges:
elementType: O N N N C C C C C C C C C C C C C C C C C C C H H H H H H H H H H H H H H H H H H H H H H H H H
charge: -0.277916 -0.246885 -0.601636 0.001899 -0.378533 -0.378400 0.081797 -0.549445 0.154795 0.379126 0.358716 -0.194045 0.488119 -0.433697 -0.400795 -0.866783 -0.818283 -0.709569 -0.236408 -0.343442 -0.502407 -0.188251 -0.335184 0.246906 0.214870 0.212037 0.250736 0.214459 0.203257 0.259630 0.236323 0.234665 0.321243 0.250487 0.218608 0.233475 0.241861 0.229636 0.243054 0.211417 0.214018 0.227005 0.299954 0.270864 0.242664 0.251684 0.228130 0.240244
chargesum: 0.00000
title: Mulliken charges with hydrogens summed into heavy atoms:
elementType: O N N N C C C C C C C C C C C C C C C C C C C
charge: -0.277916 -0.246885 -0.030817 0.001899 0.083243 0.084372 0.081797 -0.131729 0.154795 0.379126 0.358716 0.065585 0.488119 -0.197374 -0.166130 -0.076445 -0.113310 -0.041081 -0.009403 -0.100777 -0.250723 0.039880 -0.094941
polarizability: 2.36746745e+02 -1.51483593e+01 2.38488362e+02 2.60546925e+01 5.96744898e+00 1.96286475e+02
1716.lowfreq: -10.1660 -2.2090 0.0002 0.0003 0.0006 5.3368 9.8100 14.1010 33.5771
frequency: 7.3581 13.9210 33.5707 47.7756 59.5198 63.9964 73.6912 77.0636 103.0764 116.6275 126.3179 149.4875 181.8646 211.1139 215.6373 229.8412 233.1212 250.5703 254.0385 278.2478 294.9244 308.7090 325.0204 331.0981 355.6571 384.9754 395.7509 402.2332 422.6525 487.1124 487.9656 522.3935 524.0568 550.5163 562.1937 586.3349 610.2364 629.6224 675.0460 698.9387 724.2647 726.4811 748.1770 752.9782 763.9176 781.8603 799.4748 822.1473 830.5378 884.1208 898.0902 918.1390 924.5228 927.7440 939.4128 978.8061 985.3590 987.5315 1001.7538 1002.8811 1010.0805 1028.5339 1033.5750 1037.9134 1043.0870 1051.6940 1056.7388 1061.5367 1067.7772 1100.7711 1119.9631 1124.6436 1158.8551 1178.4347 1191.2848 1193.0495 1232.1975 1236.3474 1255.5900 1258.7437 1266.7666 1270.9151 1287.9050 1311.0826 1323.0754 1329.8452 1341.0170 1353.2859 1359.1740 1369.4638 1370.6757 1397.8183 1400.6339 1415.2590 1423.0906 1438.0228 1442.9751 1453.8863 1457.9740 1460.2861 1467.2026 1468.5374 1475.0174 1478.0648 1483.3992 1484.5107 1499.3043 1557.4820 1566.2873 1586.7037 1593.6419 1599.0205 1630.8886 2945.2128 2969.6575 2973.6257 2974.5956 2993.2969 3005.3990 3028.2771 3039.8694 3043.9090 3055.2997 3055.8048 3063.9150 3080.9406 3085.8484 3091.1002 3091.3773 3114.1802 3120.1254 3121.9793 3130.1689 3132.1702 3155.7934 3162.1610 3427.8712 3559.8448
redmass: 5.1965 4.6176 4.7566 4.0173 5.2073 3.3248 3.7266 3.9665 3.4646 1.3901 1.4528 3.4274 3.9974 2.9139 1.4774 1.4140 1.7397 2.9745 2.0381 2.7339 3.2733 3.3281 2.4490 1.7009 1.8800 2.9954 3.1632 4.2908 3.1583 3.9619 3.6975 3.1966 3.5806 5.2494 4.6117 4.9031 4.8612 5.3381 2.8631 1.7687 1.9688 3.5904 1.7707 4.1821 1.9733 1.2318 2.7225 2.0153 1.8402 2.0222 1.3155 2.7171 1.4120 2.1256 1.4878 1.3386 1.3982 1.6576 1.8603 2.3694 4.1532 3.3739 3.3951 1.8259 1.6137 2.8088 1.8090 2.1013 2.1945 1.6571 1.5345 1.3772 1.4559 1.1611 2.0491 1.5040 1.8250 3.9036 1.6665 1.3902 1.7870 2.6435 1.2138 6.0543 1.2741 1.4328 1.2250 1.5257 5.2222 1.2359 1.3284 1.3137 1.9023 2.0644 1.2437 1.7515 1.3564 2.0033 2.1771 1.0597 1.0898 1.0886 1.0964 1.0872 1.2029 1.0978 1.1397 5.4745 3.7600 5.9461 7.2527 5.2114 1.2658 1.0490 1.0350 1.0598 1.0406 1.0602 1.0589 1.0988 1.0858 1.0861 1.0934 1.1012 1.0988 1.1062 1.0989 1.1002 1.0999 1.0908 1.0859 1.0890 1.0917 1.0912 1.0993 1.0998 1.0449 1.0967
irintensity: 0.2399 1.6725 0.3683 0.9140 2.8477 3.1911 0.5095 0.1233 0.2909 0.3430 0.2765 1.1728 1.5978 0.3257 1.8827 1.4434 0.2103 2.3711 2.0565 4.9092 1.6228 19.3899 1.4656 33.8847 16.6367 1.2968 2.8634 10.3842 13.0094 1.2206 6.6637 0.8870 2.8243 1.5641 0.9184 0.9002 4.6203 3.1280 10.9973 180.5092 31.5361 19.5862 3.4637 0.3632 3.9289 50.1073 14.1710 14.3255 3.3855 8.5210 0.0825 2.4519 2.7918 6.2793 1.1823 0.1566 0.1080 6.3949 13.3316 0.9847 4.1205 0.6183 5.9949 7.0903 9.3126 0.9958 10.1546 16.8191 7.2465 27.8909 27.7457 10.4466 26.8116 1.9793 6.1199 2.9228 1.3716 29.9382 6.5202 9.2874 98.0893 13.5244 10.6783 1.3449 9.3103 0.5295 0.5788 10.1107 2.5455 11.3066 5.3408 18.8507 52.4973 20.0445 17.0380 5.5294 27.6067 1.9962 26.7584 16.0790 8.4846 0.3398 20.6030 7.4482 31.8706 10.6154 28.0591 2.1827 306.1644 2.7470 6.8061 13.4748 16.8353 31.3782 27.4143 21.2230 28.3855 10.5631 45.3874 8.5686 11.0937 18.6039 24.6093 1.9041 43.9947 25.5791 17.3763 35.8068 5.6002 22.2901 1.0466 8.3412 22.0682 20.5294 32.8718 28.1125 5.4476 4.3619
temp: 298.150 k
press: 1.00000 atm
elementType: 8 7 7 7 6 6 6 6 6 6 6 6 6 6 6 6 6 6 6 6 6 6 6 1 1 1 1 1 1 1 1 1 1 1 1 1 1 1 1 1 1 1 1 1 1 1 1 1
symmnumber: 1
zpe: 1058138.4 jmol-1
zpe.correction: 0.403024 hartree
zpe.thermalcorrener: 0.426610 hartree
zpe.thermalcorrenthalpy: 0.427555 hartree
zpe.thermalcorrgfe: 0.346784 hartree
zpe.sumelectzpe: -976.796693 hartree
zpe.sumelectthermal: -976.773107 hartree
zpe.sumelectthermalent: -976.772162 hartree
zpe.sumelectthermalfe: -976.852933 hartree
dipole: -3.6708 4.3004 -0.9822
dipole: 5.7387
quadrupole: -142.5836 -138.0916 -132.4254
quadrupole: 13.3551 -1.4602 -1.1661
quadrupole: -4.8834 -0.3914 5.2748 13.3551 -1.4602 -1.1661
hfenergy: -977.199717 hartree
pointgroup: C01 [X(C19H25N3O1)]
dipole: -1.6778167 1.3890859 -0.5940714 debye
polarizability: 241.2389645|-10.9517622|236.0505641|26.7377614|3.8772045|194.2320524 unknown
InChI: InChI=1S/C19H25N3O/c1-14-7-4-8-15(2)18(14)22(19(23)16(3)20)12-6-10-17-9-5-11-21-13-17/h4-5,7-9,11,13,16H,6,10,12,20H2,1-3H3
charge 0 multiplicity 1
48 atoms
O  -0.663288 -2.906376 -0.00884
N  -1.226002 -0.680121 -0.388999
N  -2.384016 -2.728759 2.252907
N  5.782244 -0.163617 0.551613
C  -0.019748 -0.530862 -1.24855
C  1.247566 -0.11563 -0.46868
C  -2.015339 0.506183 -0.101607
C  2.482103 -0.036052 -1.408858
C  -1.470486 -1.935163 0.160848
C  -1.933566 1.114427 1.189723
C  -2.83739 1.051649 -1.131415
C  -2.780354 -2.168344 0.939139
C  3.730649 0.426296 -0.679115
C  -2.683232 2.295173 1.417852
C  -3.56729 2.235638 -0.858216
C  -1.097854 0.515092 2.30617
C  -2.95771 0.388487 -2.49292
C  -3.696939 -3.097563 0.092262
C  -3.488704 2.858532 0.404396
C  4.002661 1.801361 -0.461011
C  4.661225 -0.506309 -0.149184
C  5.156319 2.180194 0.259729
C  6.014478 1.168035 0.748501
H  0.157184 -1.507042 -1.735314
H  -0.242125 0.221511 -2.027251
H  1.090001 0.868378 0.013561
H  1.44058 -0.854832 0.330116
H  2.654946 -1.034514 -1.85572
H  2.257409 0.657939 -2.24397
H  -3.303709 -1.212645 1.110903
H  -2.629279 2.773747 2.402557
H  -4.206792 2.660028 -1.641332
H  -1.461889 -0.490031 2.602067
H  -0.043115 0.387477 2.003888
H  -1.120666 1.165542 3.197141
H  -2.193637 0.765837 -3.200706
H  -2.825846 -0.705226 -2.426623
H  -3.944489 0.595802 -2.941637
H  -3.165137 -4.036617 -0.142634
H  -4.000487 -2.618124 -0.858459
H  -4.615465 -3.338664 0.659024
H  -4.058774 3.773189 0.601965
H  -1.699732 -3.488771 2.1428
H  -3.182143 -3.005838 2.834923
H  3.320421 2.563928 -0.856577
H  4.503127 -1.582946 -0.293621
H  5.391703 3.234365 0.43883
H  6.919887 1.418237 1.313325
