program: Gaussian 09
title: 000129138
version: EM64L-G09RevD.01
frameworkgroup: C1[X(C12H6Cl4N2O4)]
method: RPBEPBE
basis: SDD
operation: Freq
keyword: #p
keyword: freq=noraman
keyword: PBEPBE/SDD
title: #p freq=noraman PBEPBE/SDD
converged: NO YES NO NO
title: Mulliken charges:
elementType: Cl Cl Cl Cl O O O O N N C C C C C C C C C C C C H H H H H H
charge: 0.071981 0.064633 0.006483 -0.031389 -0.199078 -0.210074 -0.179753 -0.208736 -0.380203 0.037757 -0.293229 0.376576 0.280908 0.285297 0.294953 -0.256005 -0.349552 -0.225463 -0.174390 -0.291991 -0.128439 -0.225858 0.320808 0.368546 0.223108 0.259197 0.276514 0.287399
chargesum: 0.00000
title: Mulliken charges with hydrogens summed into heavy atoms:
elementType: Cl Cl Cl Cl O O O O N N C C C C C C C C C C C C
charge: 0.071981 0.064633 0.006483 -0.031389 -0.199078 -0.210074 -0.179753 -0.208736 -0.011657 0.037757 0.027579 0.376576 0.280908 0.285297 0.294953 0.226300 -0.073038 -0.225463 -0.174390 -0.291991 -0.128439 0.061541
polarizability: 2.59739427e+02 8.63219461e+00 1.80125486e+02 -1.37571820e+01 4.28568301e+00 1.65912095e+02
1716.lowfreq: -6.0443 -4.4468 -0.0035 -0.0024 -0.0018 6.7400 19.5479 22.9663 33.1961
frequency: 19.5367 22.8721 33.1816 49.5800 70.9929 91.2613 112.3586 129.6499 142.0480 159.3363 173.0091 174.0774 185.6185 216.6836 227.3988 257.9343 301.0102 323.3001 333.7381 347.5261 354.6893 376.6750 388.4890 422.7588 483.7605 505.3724 516.9140 529.3874 550.0357 568.4844 615.2954 634.4389 641.3093 657.3737 684.1618 711.9002 718.7526 733.8041 753.2491 796.9124 831.1632 868.7920 870.2019 886.0045 894.4750 920.4799 989.5278 993.7166 1073.6073 1085.3259 1106.5963 1167.2444 1198.4132 1210.3597 1219.8257 1229.0557 1230.8177 1254.9056 1304.2396 1327.2335 1357.7468 1368.3161 1375.3919 1393.7742 1401.2653 1419.8778 1440.5096 1464.5280 1469.0761 1550.8570 1563.1615 1598.9816 2966.5966 3092.2546 3153.3792 3155.7431 3182.6106 3548.4202
redmass: 20.9012 12.5601 15.2823 16.2755 14.2284 8.3744 11.6741 14.5736 11.8275 17.3037 15.0577 14.0764 7.8113 6.5728 6.7350 8.9746 3.8259 15.9122 19.1074 9.9114 12.5480 6.9652 9.9774 7.4195 7.1989 9.0788 5.8101 9.0712 4.2040 7.6870 7.2884 8.3634 1.1948 6.9707 8.0636 6.8918 9.7266 9.7517 9.7251 8.1098 4.5478 5.5649 1.4605 1.4988 10.1303 5.7045 6.8918 8.5919 3.2039 2.8147 1.7891 3.5120 1.9943 1.3706 1.8983 1.3665 4.5474 2.2975 3.7827 1.3737 11.8830 2.3329 2.0783 5.8138 5.4901 3.7222 2.7241 1.5072 3.6068 5.8127 8.4148 8.3311 1.0677 1.0850 1.0993 1.0929 1.0936 1.0812
irintensity: 0.6172 1.0280 0.4355 0.0894 0.2685 1.4453 2.6218 2.2388 0.7945 0.3028 0.5498 2.3423 0.1504 3.2132 0.9284 0.1942 8.9096 2.3750 0.8474 5.2034 0.6604 2.2807 1.7813 7.3731 9.4897 13.3533 18.4408 9.0894 7.2241 1.9379 1.1117 6.5813 63.6256 36.3194 42.3144 5.1719 29.3236 31.0205 6.0650 49.4124 17.6467 7.3774 31.5789 5.4057 211.6523 7.8062 40.5841 39.7119 16.1248 33.4946 4.9675 82.6656 120.8674 17.6483 70.0646 9.3197 109.0970 40.1895 125.0993 30.3105 151.3933 3.3841 10.1080 7.6352 16.5703 82.5164 155.3161 68.9234 89.9968 52.5814 27.9851 1.8837 60.4904 13.5240 7.1967 0.0473 1.4769 121.6464
temp: 298.150 k
press: 1.00000 atm
elementType: 17 17 17 17 8 8 8 8 7 7 6 6 6 6 6 6 6 6 6 6 6 6 1 1 1 1 1 1
symmnumber: 1
zpe: 437709.7 jmol-1
zpe.correction: 0.166715 hartree
zpe.thermalcorrener: 0.186560 hartree
zpe.thermalcorrenthalpy: 0.187504 hartree
zpe.thermalcorrgfe: 0.114938 hartree
zpe.sumelectzpe: -2709.813961 hartree
zpe.sumelectthermal: -2709.794116 hartree
zpe.sumelectthermalent: -2709.793171 hartree
zpe.sumelectthermalfe: -2709.865737 hartree
dipole: 2.3465 2.8417 -3.1624
dipole: 4.8561
quadrupole: -174.0673 -159.1346 -156.7865
quadrupole: -4.6112 8.6739 6.3803
quadrupole: -10.7378 4.1948 6.5430 -4.6112 8.6739 6.3803
hfenergy: -2709.9806754 hartree
pointgroup: C01 [X(C12H6Cl4N2O4)]
dipole: 1.0022266 -1.1717818 1.1281036 debye
polarizability: 261.1312925|-8.6166079|179.6180975|7.2242813|5.5528272|165.0276184 unknown
InChI: InChI=1S/C12H6Cl4N2O4/c13-4-1-5-10(6(14)2-4)21-3-22-11(5)8-9(18(19)20)7(15)12(16)17-8/h1-2,11,17H,3H2
charge 0 multiplicity 1
28 atoms
Cl -4.89186 -1.107344 0.825657
Cl -2.236718 -2.761159 2.469081
Cl 4.837313 0.681093 1.69566
Cl 3.398917 -2.854188 -2.336718
O  0.102973 2.262183 0.031777
O  2.087253 1.752478 1.325243
O  -4.429909 1.341408 -0.998469
O  -2.423966 1.717402 -2.026299
N  -0.922875 -0.902734 0.892472
N  -3.162946 1.14221 -1.127329
C  0.029239 0.9090 -0.611853
C  -1.118142 0.102867 -0.048224
C  1.379021 0.205731 -0.478995
C  2.334894 0.682145 0.463304
C  -2.518164 0.212399 -0.220911
C  0.667967 2.189897 1.349064
C  1.708248 -0.875395 -1.332404
C  -3.164853 -0.752705 0.635377
C  -2.144238 -1.430897 1.300509
C  3.614909 0.069711 0.515225
C  2.978482 -1.466514 -1.241504
C  3.947806 -1.00417 -0.326462
H  -0.197685 1.160041 -1.658474
H  -0.00344 -1.247766 1.177912
H  0.112163 1.486458 2.00367
H  0.683571 3.208514 1.755264
H  0.981407 -1.233274 -2.068806
H  4.936633 -1.465895 -0.268067
