program: Gaussian 09
title: 000129131
version: EM64L-G09RevD.01
frameworkgroup: C1[X(C14H19NO2)]
method: RPBEPBE
basis: SDD
operation: Freq
keyword: #p
keyword: freq=noraman
keyword: PBEPBE/SDD
title: #p freq=noraman PBEPBE/SDD
converged: YES YES NO NO
title: Mulliken charges:
elementType: O O N C C C C C C C C C C C C C C H H H H H H H H H H H H H H H H H H H
charge: -0.241569 -0.191807 -0.717116 0.160851 0.303197 -0.569036 -0.082989 -0.710359 -0.727112 0.046478 0.185230 0.128751 0.192239 0.187111 -0.853846 -0.849006 -0.885193 0.252947 0.245797 0.243370 0.214738 0.217264 0.221421 0.223568 0.215406 0.233069 0.220568 0.231025 0.288481 0.224269 0.227206 0.227385 0.228355 0.264605 0.318586 0.326117
chargesum: 0.00000
title: Mulliken charges with hydrogens summed into heavy atoms:
elementType: O O N C C C C C C C C C C C C C C
charge: -0.241569 -0.191807 -0.072414 0.160851 0.303197 -0.070293 -0.082989 -0.034988 -0.066716 0.046478 0.185230 0.128751 0.192239 0.187111 -0.169184 -0.109050 -0.164847
polarizability: 2.19900462e+02 6.51461657e+00 1.84223277e+02 -3.81214115e-01 -9.80567685e-01 1.02887785e+02
1716.lowfreq: -7.6239 -0.0005 -0.0003 0.0003 1.3193 6.3646 50.1623 79.9434 108.2760
frequency: 50.0583 79.9335 108.2710 112.3537 122.9186 162.6360 170.3420 181.7802 193.4310 214.0959 229.9827 241.4096 258.3982 281.0643 288.6702 302.2190 326.4667 333.4675 345.2785 356.8695 379.2883 385.4700 433.3010 438.5473 450.4153 456.9573 480.8969 510.5110 542.3002 587.0596 605.1850 633.7368 661.2679 685.3667 761.4657 769.4826 830.7960 860.0985 886.8901 922.7358 932.9596 950.3902 988.8619 994.9959 1014.7898 1023.0403 1025.8004 1037.6017 1049.5887 1067.6230 1103.8872 1116.4021 1125.0296 1157.5964 1193.8531 1219.7564 1245.8542 1266.2873 1297.0515 1340.0887 1364.2278 1381.3540 1389.9977 1392.0148 1398.4994 1401.7183 1425.9175 1433.8239 1450.6163 1457.3142 1465.1106 1469.9828 1476.0752 1477.0324 1483.5212 1490.1917 1497.7747 1500.8193 1515.8528 1588.4528 1597.3649 1639.8469 1679.1416 2948.3057 2960.1282 2974.2035 2979.5367 2981.8972 2986.9897 3010.8771 3029.0848 3050.3805 3068.1155 3071.2474 3077.8390 3085.1570 3110.6831 3110.8591 3123.2317 3123.3513 3585.8881 3721.7562
redmass: 4.0064 3.2139 3.6164 2.2761 1.9898 1.5513 1.4864 1.1002 1.3426 2.8792 1.8325 1.1948 2.9211 2.2256 1.6560 2.0642 2.3647 2.5972 1.9463 2.2798 3.7537 2.6464 3.5008 4.0734 2.5536 2.9460 3.4821 3.8562 4.5542 3.6092 4.2477 3.1168 6.4325 5.3902 3.9166 5.1845 3.5598 3.0077 2.7597 1.8822 1.5271 1.9572 2.0029 1.5702 1.3990 1.8548 1.4475 1.4969 1.5795 2.3086 2.3775 2.3485 1.9247 4.2411 2.6788 3.2673 2.9998 2.3256 1.6648 4.2832 5.2751 1.1829 1.4210 1.2838 1.2274 1.2057 3.1798 1.0980 2.1118 1.1034 1.0604 1.1244 1.0554 1.0682 1.2153 1.3117 1.1126 1.0469 1.0748 5.4939 6.7688 1.1981 11.4502 1.0422 1.0427 1.0356 1.0404 1.0622 1.0412 1.0972 1.0970 1.0972 1.0996 1.0989 1.1000 1.0957 1.0950 1.0927 1.0921 1.0950 1.0449 1.1029
irintensity: 0.3133 0.6225 3.5510 0.1157 1.5305 0.3003 0.5989 2.6918 1.2428 0.2135 1.2670 1.1385 2.6323 54.6919 115.9575 42.5374 20.1941 2.6037 13.2545 1.6799 5.2718 0.6768 2.9742 1.5312 5.4506 4.5140 1.9807 3.3875 2.1586 2.1111 4.7274 3.5662 5.1171 1.2074 11.6280 1.1177 6.7929 3.9810 24.2826 2.1877 0.5639 12.2926 17.5974 16.5996 5.6807 40.5449 7.9179 6.0777 0.1416 59.8752 20.6142 101.4143 11.6829 84.2103 68.4631 106.1706 38.2711 8.5133 4.1110 14.0154 12.8425 24.2914 33.4126 3.2293 13.6672 16.6495 109.7895 15.2299 13.3447 0.2650 1.4437 6.3332 18.7452 11.2015 40.9590 17.4417 2.0739 1.3053 22.5518 24.8006 4.3669 213.1468 408.4318 50.5820 48.5615 29.6623 36.3227 6.5837 36.5019 25.3496 24.9140 20.7768 7.3237 45.8025 19.7850 30.1906 7.9087 19.5834 30.3970 3.3186 51.9812 23.8099
temp: 298.150 k
press: 1.00000 atm
elementType: 8 8 7 6 6 6 6 6 6 6 6 6 6 6 6 6 6 1 1 1 1 1 1 1 1 1 1 1 1 1 1 1 1 1 1 1
symmnumber: 1
zpe: 788154.0 jmol-1
zpe.correction: 0.300192 hartree
zpe.thermalcorrener: 0.318129 hartree
zpe.thermalcorrenthalpy: 0.319073 hartree
zpe.thermalcorrgfe: 0.256704 hartree
zpe.sumelectzpe: -748.827226 hartree
zpe.sumelectthermal: -748.809289 hartree
zpe.sumelectthermalent: -748.808345 hartree
zpe.sumelectthermalfe: -748.870715 hartree
dipole: 4.7695 4.8891 -1.2195
dipole: 6.9382
quadrupole: -97.9246 -101.9060 -103.4897
quadrupole: -10.7520 2.0763 1.4430
quadrupole: 3.1822 -0.7992 -2.3829 -10.7520 2.0763 1.4430
hfenergy: -749.1274181 hartree
pointgroup: C01 [X(C14H19N1O2)]
dipole: 1.9730256 1.812335 -0.5232961 debye
polarizability: 220.4584917|4.4091142|183.5930516|-2.8977862|-1.1471128|102.9599807 unknown
InChI: InChI=1S/C14H19NO2/c1-7-8(2)13-11(9(3)12(7)15)14(4,5)6-10(16)17-13/h6,15H2,1-5H3
charge 0 multiplicity 1
36 atoms
O  -1.279397 -1.636353 0.255803
O  -3.550602 -1.884302 0.221557
N  3.456552 1.371553 -0.071778
C  -1.633143 1.239461 -0.007085
C  -0.212041 0.615033 0.035066
C  -2.590252 0.203211 -0.68224
C  -0.119041 -0.804569 0.060163
C  -2.135304 1.541244 1.435232
C  -1.75101 2.510126 -0.900721
C  1.006154 1.353258 0.070562
C  1.103606 -1.519216 0.014156
C  -2.568814 -1.16396 -0.039591
C  2.2522 0.651551 -0.029421
C  2.30617 -0.775931 -0.072078
C  1.074313 2.860055 0.282908
C  1.103804 -3.039198 0.043855
C  3.660117 -1.456202 -0.176837
H  -2.288069 0.082185 -1.742947
H  -3.629925 0.569581 -0.664838
H  -2.160503 0.624713 2.052144
H  -1.473506 2.265916 1.942174
H  -3.156584 1.966799 1.410049
H  -1.373288 3.420972 -0.413435
H  -1.207398 2.376578 -1.853606
H  -2.816506 2.691184 -1.137678
H  0.18266 3.245152 0.795313
H  1.933406 3.110652 0.935072
H  1.189433 3.430709 -0.660859
H  0.080188 -3.426083 0.145315
H  1.539376 -3.459848 -0.882499
H  1.700063 -3.42448 0.892031
H  4.210773 -1.122138 -1.080123
H  4.300674 -1.23543 0.702465
H  3.568026 -2.550077 -0.240147
H  3.463941 2.379241 -0.182181
H  4.345027 0.883214 -0.099299
