program: Gaussian 09
title: 000129120
version: EM64L-G09RevD.01
frameworkgroup: C1[X(C10H10N2O2)]
method: RPBEPBE
basis: SDD
operation: Freq
keyword: #p
keyword: freq=noraman
keyword: PBEPBE/SDD
title: #p freq=noraman PBEPBE/SDD
converged: YES YES NO NO
title: Mulliken charges:
elementType: O O N N C C C C C C C C C C H H H H H H H H H H
charge: -0.436976 -0.223828 -0.217785 0.062903 0.342409 0.140008 0.290705 -0.545169 -0.425256 -0.397983 -0.342176 -0.323255 -0.240852 -0.207261 0.241165 0.210228 0.320783 0.240766 0.270261 0.226817 0.201077 0.230945 0.234122 0.348352
chargesum: 0.00000
title: Mulliken charges with hydrogens summed into heavy atoms:
elementType: O O N N C C C C C C C C C C
charge: -0.088624 -0.223828 -0.217785 0.062903 0.342409 0.140008 0.290705 -0.093777 -0.104473 -0.157217 -0.071915 0.104639 -0.009907 0.026861
polarizability: 1.54020725e+02 -6.24638177e-01 1.89112741e+02 1.54473651e+01 1.77941555e+00 6.78525346e+01
1716.lowfreq: -11.5377 -0.0010 -0.0008 -0.0005 3.2319 6.8135 32.3684 64.2847 102.3263
frequency: 32.0447 64.2335 102.3254 118.5885 168.1393 176.7364 211.8429 255.0249 275.3807 347.8801 373.5045 390.2447 425.3455 470.0501 506.0758 529.6035 569.5439 581.3279 647.5172 693.7693 736.7251 760.1062 768.3398 818.4195 829.5708 847.2594 874.8597 917.2204 952.3562 974.2191 987.9557 1007.5196 1012.6675 1021.0738 1084.2749 1100.9637 1116.4834 1156.5771 1176.5607 1184.2396 1203.3828 1264.6194 1307.2327 1316.8909 1322.3571 1347.4159 1360.2614 1380.1921 1410.5618 1451.8180 1454.5169 1467.0722 1470.7110 1555.4728 1597.9195 1621.9859 2961.7770 2995.7587 3064.7968 3083.4741 3134.0835 3146.7813 3163.9368 3181.8522 3246.8493 3532.2440
redmass: 5.4916 6.2850 5.7635 2.6868 7.1721 4.2450 4.9038 3.2105 4.6978 1.2721 7.8617 2.8154 3.0155 3.9382 3.7915 5.3532 4.8935 4.2839 3.1751 5.7040 4.6605 2.1054 1.8933 1.5884 3.7735 2.5573 1.3910 1.8527 1.3914 4.6145 1.3210 4.0075 2.2285 2.0139 2.6745 2.9999 1.6312 1.1738 1.1481 1.3634 2.2471 1.7611 1.6462 1.6371 1.2842 2.7061 4.7196 1.4976 4.1571 2.1975 1.4095 2.8551 1.0894 6.1133 7.1698 7.8397 1.0684 1.0621 1.0991 1.0971 1.0863 1.0911 1.0964 1.0979 1.0980 1.0658
irintensity: 1.2929 2.0081 0.3923 2.3511 3.1835 2.1361 4.1184 1.0084 8.7016 136.0014 3.1602 30.2048 9.0606 8.0015 5.1199 10.8629 8.1102 1.9787 0.5449 7.4172 17.7550 43.0183 63.9902 17.4479 50.2749 8.6287 0.4672 25.6267 3.8351 58.8015 0.1498 94.6060 4.5269 43.0883 113.6885 77.1196 0.2846 22.3412 16.1939 40.4339 35.1918 80.2897 10.7333 20.9636 6.6383 41.8845 164.2996 37.4111 7.5286 23.7060 17.0403 1.7535 2.6129 13.8012 0.0500 1.7253 53.1269 25.0377 14.4430 44.2918 1.3548 12.7640 20.9330 6.6072 16.4832 0.9210
temp: 298.150 k
press: 1.00000 atm
elementType: 8 8 7 7 6 6 6 6 6 6 6 6 6 6 1 1 1 1 1 1 1 1 1 1
symmnumber: 1
zpe: 480363.7 jmol-1
zpe.correction: 0.182961 hartree
zpe.thermalcorrener: 0.195242 hartree
zpe.thermalcorrenthalpy: 0.196187 hartree
zpe.thermalcorrgfe: 0.143593 hartree
zpe.sumelectzpe: -645.931182 hartree
zpe.sumelectthermal: -645.918901 hartree
zpe.sumelectthermalent: -645.917956 hartree
zpe.sumelectthermalfe: -645.970550 hartree
dipole: 0.4933 -4.3595 -1.0339
dipole: 4.5075
quadrupole: -84.4980 -85.8484 -83.6281
quadrupole: -2.8309 7.9067 0.0163
quadrupole: 0.1602 -1.1902 1.0301 -2.8309 7.9067 0.0163
hfenergy: -646.114143 hartree
pointgroup: C01 [X(C10H10N2O2)]
dipole: 0.5373507 1.6448945 0.3879889 debye
dipolederiv: -0.3332626 -0.0779716 -0.1241009 -0.2016557 -0.4814812 -0.0716284 -0.2911558 0.0387797 -0.7274873 -0.2112777 -1.0347073 -0.0135753 0.0740596 -1.3984624 -0.0567762 0.0186784 0.185933 -0.1639203 -0.1267298 0.5481505 0.0646154 -0.0386335 -1.3835709 -0.0423093 0.0572416 -0.2128755 0.0386859 -0.0026275 0.3611292 -0.0311434 -0.1489622 2.2607129 0.1201793 -0.0281957 0.0476169 -0.0546335 0.3979796 -0.2142393 -0.0743993 -0.1270868 0.0770206 -0.0026267 -0.1828826 0.0870289 -0.116176 -0.0313117 0.457822 0.0373736 0.0130245 0.0101584 -0.001784 0.0057151 -0.1082063 -0.0148872 -0.0348947 0.2705662 0.0308487 0.2715556 0.5534707 -0.0287526 0.037475 -0.0398606 0.0306202 -0.1110225 0.1154542 -0.0989564 0.168822 -0.0679397 0.0722349 -0.2202396 0.1629482 -0.0402458 -0.0810389 -0.3053553 -0.0473234 -0.117112 -0.1854056 0.0262 -0.0493666 0.0174875 -0.1418894 0.0241048 -0.2283469 -0.0561975 -0.0131961 -0.0420624 0.0046238 -0.0412879 0.0690332 -0.1279001 0.0050012 -0.1779742 -0.0454176 -0.0607671 -0.0880853 0.019918 -0.0410517 0.0454156 -0.1194698 0.3773681 0.0322857 0.0814512 0.0947249 0.4459694 0.0758478 0.3547352 -0.0971742 0.5209691 -0.0864758 0.196505 -0.0106065 0.0853934 0.0549204 -0.0052899 -0.014157 -0.0440214 -0.1550027 0.0700231 -0.0195333 -0.0653329 -0.0190779 0.1157106 0.0189506 -0.0615123 0.0245099 -0.1472411 -0.038861 -0.0130514 0.0717994 -0.0644296 0.0043716 0.1042004 0.0654423 0.0242142 0.0339138 0.0422059 -0.0393826 -0.0651674 0.0078211 -0.0529188 -0.1131181 -0.0060981 -0.1112304 0.0083522 0.0913019 0.0339683 0.0311864 -0.028259 0.1024059 0.0001367 0.0350028 -0.0076779 0.191946 0.0271987 0.1077434 0.0405144 0.0784798 -0.0092564 -0.0248253 0.0385457 -0.0333982 0.1350317 0.0678704 0.0279972 0.0289551 0.0699421 0.0143214 -0.0276675 0.0321119 -0.0179988 0.1646209 -0.1085171 0.1419709 0.0273706 0.0951708 -0.0214892 -0.0425418 -0.0116557 -0.0214339 0.0525649 -0.0366244 -0.1600218 0.0592101 -0.100345 -0.0657021 0.0419795 0.0400418 0.0548676 -0.0542456 0.0556624 -0.0760415 0.0203537 -0.0856803 -0.0925067 0.0028902 0.0221727 0.0024798 0.1567102 -0.0934398 -0.0400405 0.0610966 -0.0339644 0.0850839 0.0034547 0.0637319 0.0070882 0.1461755 0.1373673 0.0930731 0.0774454 0.0801758 0.1647348 -0.0732957 0.1767089 -0.0735255 0.3835085 unknown
polarizability: 155.8451935|7.3595702|187.5167385|-14.4887396|3.3833598|67.6240685 unknown
InChI: InChI=1S/C10H10N2O2/c13-6-5-8-7-12(11-14)10-4-2-1-3-9(8)10/h1-4,7,13H,5-6H2
charge 0 multiplicity 1
24 atoms
O  -3.558206 0.452131 -1.196961
O  0.057568 -3.724065 0.033393
N  0.341541 -1.494548 0.097468
N  0.899971 -2.777063 -0.121165
C  -1.070377 0.234273 0.579255
C  0.258628 0.785486 0.267206
C  1.125477 -0.312814 -0.029049
C  -2.306406 1.031936 0.896337
C  -0.985064 -1.148047 0.460858
C  0.77622 2.100949 0.220935
C  2.478787 -0.157868 -0.366778
C  -3.016356 1.545941 -0.390666
C  2.137157 2.278435 -0.117539
C  2.974733 1.166744 -0.407457
H  -3.029398 0.414137 1.458186
H  -2.049224 1.904236 1.528565
H  -1.726464 -1.924337 0.630508
H  0.14302 2.965803 0.446799
H  3.11604 -1.018256 -0.586077
H  -3.89427 2.151368 -0.112215
H  -2.321028 2.176512 -0.984539
H  2.55797 3.288822 -0.157811
H  4.025097 1.337951 -0.665862
H  -2.816118 -0.151627 -1.46099
