program: Gaussian 09
title: 000129196
version: EM64L-G09RevD.01
frameworkgroup: C1[X(C15H20Cl2N2O2)]
method: RPBEPBE
basis: SDD
operation: Freq
keyword: #p
keyword: freq=noraman
keyword: PBEPBE/SDD
title: #p freq=noraman PBEPBE/SDD
converged: YES YES NO NO
title: Mulliken charges:
elementType: Cl Cl O O N N C C C C C C C C C C C C C C C H H H H H H H H H H H H H H H H H H H H
charge: -0.071961 -0.077166 -0.235725 -0.258686 -0.262541 -0.427293 -0.204013 -0.446550 -0.568673 -0.521910 0.133216 0.310248 0.295168 -0.401138 0.199081 -0.378412 -0.255338 -0.345292 -0.315898 -0.574220 -0.584090 0.260253 0.214350 0.239768 0.233246 0.259976 0.233853 0.243256 0.238451 0.238594 0.230540 0.225719 0.240664 0.232777 0.224195 0.256236 0.272368 0.272150 0.256750 0.296406 0.321642
chargesum: 0.00000
title: Mulliken charges with hydrogens summed into heavy atoms:
elementType: Cl Cl O O N N C C C C C C C C C C C C C C C
charge: -0.071961 -0.077166 -0.235725 -0.258686 -0.262541 0.190755 0.056240 0.007568 -0.075451 -0.044801 0.133216 0.310248 0.295168 -0.162688 0.199081 -0.139818 -0.024798 0.121091 0.141074 -0.045615 -0.055191
polarizability: 2.23761019e+02 2.10288917e+00 2.05489610e+02 4.78071594e+00 -1.50183246e+01 1.77472528e+02
1716.lowfreq: -10.7297 -8.4961 -3.8803 -0.0019 -0.0016 -0.0012 8.9614 13.6572 20.3061
frequency: 5.4574 13.5368 20.2901 29.7259 34.2333 43.8991 56.2712 72.3917 84.9324 129.5302 156.9378 167.8093 188.3389 190.9848 197.9260 208.2097 217.0878 237.0090 279.7559 308.6792 315.8452 332.0812 346.3577 380.1209 409.5870 471.3285 480.8751 492.7628 520.5878 541.8475 554.6642 583.2616 616.6934 630.0534 658.8610 667.7608 726.4837 762.0404 765.6490 773.4596 783.9641 786.7615 801.0679 809.9694 849.6637 885.3831 912.5606 921.5573 949.9304 980.5384 986.4875 995.1403 1012.9330 1031.8329 1035.6965 1042.7126 1057.0077 1082.2572 1102.4419 1114.1990 1118.6808 1131.3513 1160.3503 1170.2068 1181.7241 1191.2753 1211.2828 1225.3584 1230.5285 1233.3247 1241.1775 1245.9482 1273.4888 1283.2568 1298.3789 1298.8265 1312.6892 1334.8807 1343.6348 1350.5858 1354.9273 1361.4040 1366.7837 1371.2282 1438.2105 1441.0438 1447.7355 1453.1933 1455.4210 1456.3885 1464.8242 1467.7721 1472.2871 1547.0098 1590.0146 1597.6602 1643.6270 2964.9687 2974.1960 2978.5064 2981.1434 2987.3482 3003.4439 3030.8721 3042.1063 3048.6392 3049.1222 3055.0348 3057.8430 3078.2386 3118.6779 3133.8198 3144.6186 3148.1318 3158.1566 3252.5425 3455.4907
redmass: 5.6772 6.7141 6.5466 6.9625 9.2056 7.7161 2.8282 4.2950 2.3457 3.6458 4.1398 4.3735 3.2928 2.0676 3.8551 4.5093 2.4393 2.8714 3.9177 2.8928 2.6736 2.5861 4.6528 4.7828 4.4717 5.5965 4.0519 3.5066 4.6979 4.4623 4.2930 3.8041 3.5556 4.8741 5.3472 5.3061 2.3390 2.6065 1.2360 1.2243 3.3958 3.3544 2.6000 3.4550 2.6839 2.3005 1.5741 2.8827 1.9029 1.4425 1.9254 1.4946 2.2395 2.3086 3.7931 3.0354 2.1161 2.0072 1.6025 1.3716 1.3824 2.2419 1.3217 1.2815 1.4322 2.3665 1.6540 1.8824 1.8652 1.3809 1.2005 1.1594 1.5034 1.4989 1.2184 1.3260 1.6761 1.4581 1.8009 1.3453 1.5537 1.3517 1.8302 2.2570 1.5906 1.1075 1.1512 1.1000 1.1922 1.7325 1.3467 1.1253 1.3637 1.3449 6.6795 6.5025 3.6184 1.0659 1.0731 1.0589 1.0594 1.0711 1.0688 1.0916 1.1044 1.0963 1.1018 1.0574 1.0569 1.0991 1.0873 1.0909 1.1126 1.1122 1.0994 1.0457 1.0940
irintensity: 0.1691 0.3267 0.9764 0.3584 1.5178 1.1162 0.2062 0.2061 2.3208 5.5761 6.2024 2.3954 17.5803 41.6005 4.1036 16.9469 20.4578 8.7705 3.8675 14.6785 1.1546 2.6026 14.9359 27.3987 8.1195 4.0165 4.3187 2.9792 1.9555 9.5898 3.2038 12.3010 5.9369 16.1270 110.0227 59.7545 9.5916 3.8168 15.7874 14.8273 4.6964 56.2642 8.8669 14.2082 4.1993 4.8135 1.6490 3.3134 6.7656 2.8727 19.7793 5.8041 3.7411 21.3815 4.2648 2.1214 10.4642 6.4505 31.1863 8.6155 31.1354 240.2299 3.1941 4.7914 19.8394 0.7089 7.3215 24.9055 29.7609 4.8579 6.4960 9.1501 16.0676 5.0565 4.3446 16.3736 6.0509 10.4533 3.1299 5.0297 4.3626 3.1594 6.4433 1.9237 0.7052 6.9762 3.1709 4.9788 25.2455 30.2768 48.2260 15.9633 4.9595 104.8354 23.7650 5.6006 84.0041 18.0427 14.6912 20.0751 30.7679 20.3143 37.8283 31.4725 8.9870 5.4130 24.5369 14.5572 25.2079 23.0053 4.1014 30.4520 10.9936 22.7072 24.1376 6.2832 8.7662
temp: 298.150 k
press: 1.00000 atm
elementType: 17 17 8 8 7 7 6 6 6 6 6 6 6 6 6 6 6 6 6 6 6 1 1 1 1 1 1 1 1 1 1 1 1 1 1 1 1 1 1 1 1
symmnumber: 1
zpe: 862775.6 jmol-1
zpe.correction: 0.328614 hartree
zpe.thermalcorrener: 0.350749 hartree
zpe.thermalcorrenthalpy: 0.351694 hartree
zpe.thermalcorrgfe: 0.270821 hartree
zpe.sumelectzpe: -1762.023680 hartree
zpe.sumelectthermal: -1762.001544 hartree
zpe.sumelectthermalent: -1762.000600 hartree
zpe.sumelectthermalfe: -1762.081472 hartree
dipole: 0.6174 -1.7760 0.2090
dipole: 1.8919
quadrupole: -164.0323 -143.6391 -138.5807
quadrupole: -7.5540 -6.6402 -4.6417
quadrupole: -15.2816 5.1116 10.1700 -7.5540 -6.6402 -4.6417
hfenergy: -1762.3522935 hartree
pointgroup: C01 [X(C15H20Cl2N2O2)]
dipole: 0.2341279 -0.704457 0.0541861 debye
polarizability: 222.5709132|2.7812341|207.4135689|8.9662546|-12.7692884|176.7386757 unknown
InChI: InChI=1S/C15H20Cl2N2O2/c16-6-8-19(9-7-17)14-3-1-2-11-10-12(15(20)21-18)4-5-13(11)14/h1-3,12H,4-10,18H2
charge 0 multiplicity 1
41 atoms
Cl -5.419214 -1.271339 -2.067316
Cl -2.264709 4.340291 0.781932
O  3.686437 1.327173 -1.03059
O  4.03013 0.435264 1.086549
N  -1.959592 0.360538 -0.399982
N  4.408179 2.540004 -0.524508
C  3.087408 -1.004866 -0.717138
C  2.049896 -0.778434 -1.84484
C  2.500621 -1.936484 0.367617
C  0.774942 -0.101403 -1.301521
C  0.240487 -0.750003 -0.028587
C  1.062044 -1.603044 0.760263
C  -1.106929 -0.502153 0.387291
C  0.532518 -2.198923 1.93244
C  3.616898 0.284513 -0.088119
C  -1.614826 -1.111577 1.559001
C  -0.797493 -1.965286 2.332018
C  -2.897272 -0.234108 -1.364122
C  -1.753488 1.813862 -0.359983
C  -4.27469 -0.538138 -0.741047
C  -2.643181 2.478879 0.708078
H  3.98341 -1.494538 -1.152596
H  1.799123 -1.770192 -2.26855
H  2.48242 -0.167536 -2.65484
H  2.534704 -2.975187 -0.017853
H  3.14351 -1.90917 1.265932
H  1.002086 0.967419 -1.108958
H  -0.015951 -0.098762 -2.074757
H  1.177271 -2.848582 2.537294
H  -2.642806 -0.89203 1.868114
H  -1.190137 -2.428318 3.243665
H  -3.036797 0.457553 -2.217724
H  -2.47755 -1.175523 -1.768067
H  -0.697782 2.041116 -0.121183
H  -1.971152 2.261065 -1.349816
H  -4.78402 0.367584 -0.378834
H  -4.216652 -1.300556 0.049433
H  -2.433335 2.091765 1.716313
H  -3.716113 2.409527 0.473785
H  3.728823 3.29807 -0.711519
H  4.522685 2.379928 0.500626
